BDBM50156262 CHEMBL188315::Thiophene-2-sulfonic acid (3-{(R)-1-hydroxy-2-[(R)-2-(7-isopropoxy-1H-indol-3-yl)-1-methyl-ethylamino]-ethyl}-phenyl)-amide
SMILES: CC(C)Oc1cccc2c(C[C@@H](C)NC[C@H](O)c3cccc(NS(=O)(=O)c4cccs4)c3)c[nH]c12
InChI Key: InChIKey=GSSWFUNMAVJYOH-JPYJTQIMSA-N
Data: 2 EC50
Activity Spreadsheet -- Enzyme Inhibition Constant Data from BindingDB
Found 2 hits for monomerid = 50156262
Trg + Lig
Ki
nM
ΔG°
kcal/mole
IC50
nM
Kd
nM
EC50/IC50
nM
koff
s-1
kon
M-1s-1
pHTemp
°C
Beta-3 adrenergic receptor
(Homo sapiens (Human))
BDBM50156262
(CHEMBL188315 | Thiophene-2-sulfonic acid (3-{(R)-1...)
Show SMILES CC(C)Oc1cccc2c(C[C@@H](C)NC[C@H](O)c3cccc(NS(=O)(=O)c4cccs4)c3)c[nH]c12
Show InChI InChI=1S/C26H31N3O4S2/c1-17(2)33-24-10-5-9-22-20(15-28-26(22)24)13-18(3)27-16-23(30)19-7-4-8-21(14-19)29-35(31,32)25-11-6-12-34-25/h4-12,14-15,17-18,23,27-30H,13,16H2,1-3H3/t18-,23+/m1/s1
Reactome pathway
n/an/an/an/a 2n/an/an/an/a
Dainippon Pharmaceutical Co., Ltd
Curated by ChEMBL
Assay Description
Binding inhibition constant was determined by inhibition of [125I]iodocyanopindolol binding to Beta-3 adrenergic receptor
Bioorg Med Chem Lett 14: 5959-62 (2004)
Article DOI: 10.1016/j.bmcl.2004.10.035
BindingDB Entry DOI: 10.7270/Q2GQ6X7S
Beta-2 adrenergic receptor
(Homo sapiens (Human))
BDBM50156262
(CHEMBL188315 | Thiophene-2-sulfonic acid (3-{(R)-1...)
Show SMILES CC(C)Oc1cccc2c(C[C@@H](C)NC[C@H](O)c3cccc(NS(=O)(=O)c4cccs4)c3)c[nH]c12
Show InChI InChI=1S/C26H31N3O4S2/c1-17(2)33-24-10-5-9-22-20(15-28-26(22)24)13-18(3)27-16-23(30)19-7-4-8-21(14-19)29-35(31,32)25-11-6-12-34-25/h4-12,14-15,17-18,23,27-30H,13,16H2,1-3H3/t18-,23+/m1/s1
Reactome pathway
n/an/an/an/a 12n/an/an/an/a
Dainippon Pharmaceutical Co., Ltd
Curated by ChEMBL
Assay Description
Agonistic activity was determined by measuring cAMP accumulation in CHO cells expressing cloned human Beta-2 adrenergic receptor
Bioorg Med Chem Lett 14: 5959-62 (2004)
Article DOI: 10.1016/j.bmcl.2004.10.035
BindingDB Entry DOI: 10.7270/Q2GQ6X7S