null
SMILES: CCS(=O)(=O)c1ccc(OC2CCCCC2)c(c1)-c1cn(C)c(=O)c2[nH]c(cc12)-c1cnn(c1)C1CCNCC1
InChI Key: InChIKey=DKGDSOBOFUOPQW-UHFFFAOYSA-N
Activity Spreadsheet -- Enzyme Inhibition Constant Data from BindingDB
Found 3 hits for monomerid = 50156345
Trg + Lig
Ki
nM
ΔG°
kcal/mole
IC50
nM
Kd
nM
EC50/IC50
nM
koff
s-1
kon
M-1s-1
pHTemp
°C
Bromodomain-containing protein 4
(Homo sapiens (Human))
BDBM50156345
(CHEMBL3787680 | US9957263, Example 149)
Show SMILES CCS(=O)(=O)c1ccc(OC2CCCCC2)c(c1)-c1cn(C)c(=O)c2[nH]c(cc12)-c1cnn(c1)C1CCNCC1
Show InChI InChI=1S/C30H37N5O4S/c1-3-40(37,38)23-9-10-28(39-22-7-5-4-6-8-22)24(15-23)26-19-34(2)30(36)29-25(26)16-27(33-29)20-17-32-35(18-20)21-11-13-31-14-12-21/h9-10,15-19,21-22,31,33H,3-8,11-14H2,1-2H3
n/an/a 3n/an/an/an/an/an/a
Genentech
Curated by ChEMBL
Assay Description
Displacement of biotinylated tetra-acetylated histone H4 from human his-tagged BRD4 bromodomain1 (57 to 168 residues) incubated for 1 hr by TR-FRET a...
J Med Chem 59: 1271-98 (2016)
Article DOI: 10.1021/acs.jmedchem.5b01514
BindingDB Entry DOI: 10.7270/Q2X92D6H
Bromodomain-containing protein 4
(Homo sapiens (Human))
BDBM50156345
(CHEMBL3787680 | US9957263, Example 149)
Show SMILES CCS(=O)(=O)c1ccc(OC2CCCCC2)c(c1)-c1cn(C)c(=O)c2[nH]c(cc12)-c1cnn(c1)C1CCNCC1
Show InChI InChI=1S/C30H37N5O4S/c1-3-40(37,38)23-9-10-28(39-22-7-5-4-6-8-22)24(15-23)26-19-34(2)30(36)29-25(26)16-27(33-29)20-17-32-35(18-20)21-11-13-31-14-12-21/h9-10,15-19,21-22,31,33H,3-8,11-14H2,1-2H3
US Patent
0.669n/an/an/an/an/an/an/an/a
GSK
Assay Description
Compound dilution series were prepared in DMSO via a 3-fold serial dilution from 2.5 mM to 42 nM. Compounds were then diluted 6:100 in assay buffer (...
Bioorg Med Chem Lett 19: 360-4 (2009)
BindingDB Entry DOI: 10.7270/Q2Q81GDF
Bromodomain-containing protein 4
(Homo sapiens (Human))
BDBM50156345
(CHEMBL3787680 | US9957263, Example 149)
Show SMILES CCS(=O)(=O)c1ccc(OC2CCCCC2)c(c1)-c1cn(C)c(=O)c2[nH]c(cc12)-c1cnn(c1)C1CCNCC1
Show InChI InChI=1S/C30H37N5O4S/c1-3-40(37,38)23-9-10-28(39-22-7-5-4-6-8-22)24(15-23)26-19-34(2)30(36)29-25(26)16-27(33-29)20-17-32-35(18-20)21-11-13-31-14-12-21/h9-10,15-19,21-22,31,33H,3-8,11-14H2,1-2H3
US Patent
2.81n/an/an/an/an/an/an/an/a
GSK
Assay Description
Compound dilution series were prepared in DMSO via a 3-fold serial dilution from 2.5 mM to 42 nM. Compounds were then diluted 6:100 in assay buffer (...
Bioorg Med Chem Lett 19: 360-4 (2009)
BindingDB Entry DOI: 10.7270/Q2Q81GDF