BDBM50156526 3-{4-[2-(2-Biphenyl-4-yl-5-methyl-oxazol-4-yl)-ethoxy]-phenyl}-2-(4-tert-butyl-phenoxy)-2-methyl-propionic acid::CHEMBL362759
SMILES: Cc1oc(nc1CCOc1ccc(CC(C)(Oc2ccc(cc2)C(C)(C)C)C(O)=O)cc1)-c1ccc(cc1)-c1ccccc1
InChI Key: InChIKey=LWFGKMLICQWLKL-UHFFFAOYSA-N
Data: 2 IC50  2 EC50
Activity Spreadsheet -- Enzyme Inhibition Constant Data from BindingDB
Found 4 hits for monomerid = 50156526
Trg + Lig
Ki
nM
ΔG°
kcal/mole
IC50
nM
Kd
nM
EC50/IC50
nM
koff
s-1
kon
M-1s-1
pHTemp
°C
Peroxisome proliferator-activated receptor alpha
(Homo sapiens (Human))
BDBM50156526
(3-{4-[2-(2-Biphenyl-4-yl-5-methyl-oxazol-4-yl)-eth...)
Show SMILES Cc1oc(nc1CCOc1ccc(CC(C)(Oc2ccc(cc2)C(C)(C)C)C(O)=O)cc1)-c1ccc(cc1)-c1ccccc1
Show InChI InChI=1S/C38H39NO5/c1-26-34(39-35(43-26)30-15-13-29(14-16-30)28-9-7-6-8-10-28)23-24-42-32-19-11-27(12-20-32)25-38(5,36(40)41)44-33-21-17-31(18-22-33)37(2,3)4/h6-22H,23-25H2,1-5H3,(H,40,41)
n/an/an/an/a 260n/an/an/an/a
Lilly Research Laboratories
Curated by ChEMBL
Assay Description
Transactivation activity for human Peroxisome proliferator activated receptor alpha
Bioorg Med Chem Lett 14: 6113-6 (2004)
Article DOI: 10.1016/j.bmcl.2004.09.031
BindingDB Entry DOI: 10.7270/Q2QN67J1
Peroxisome proliferator-activated receptor alpha
(Homo sapiens (Human))
BDBM50156526
(3-{4-[2-(2-Biphenyl-4-yl-5-methyl-oxazol-4-yl)-eth...)
Show SMILES Cc1oc(nc1CCOc1ccc(CC(C)(Oc2ccc(cc2)C(C)(C)C)C(O)=O)cc1)-c1ccc(cc1)-c1ccccc1
Show InChI InChI=1S/C38H39NO5/c1-26-34(39-35(43-26)30-15-13-29(14-16-30)28-9-7-6-8-10-28)23-24-42-32-19-11-27(12-20-32)25-38(5,36(40)41)44-33-21-17-31(18-22-33)37(2,3)4/h6-22H,23-25H2,1-5H3,(H,40,41)
n/an/a 196n/an/an/an/an/an/a
Lilly Research Laboratories
Curated by ChEMBL
Assay Description
In vitro inhibition of human Peroxisome proliferator activated receptor alpha
Bioorg Med Chem Lett 14: 6113-6 (2004)
Article DOI: 10.1016/j.bmcl.2004.09.031
BindingDB Entry DOI: 10.7270/Q2QN67J1
Peroxisome proliferator-activated receptor alpha
(Mus musculus)
BDBM50156526
(3-{4-[2-(2-Biphenyl-4-yl-5-methyl-oxazol-4-yl)-eth...)
Show SMILES Cc1oc(nc1CCOc1ccc(CC(C)(Oc2ccc(cc2)C(C)(C)C)C(O)=O)cc1)-c1ccc(cc1)-c1ccccc1
Show InChI InChI=1S/C38H39NO5/c1-26-34(39-35(43-26)30-15-13-29(14-16-30)28-9-7-6-8-10-28)23-24-42-32-19-11-27(12-20-32)25-38(5,36(40)41)44-33-21-17-31(18-22-33)37(2,3)4/h6-22H,23-25H2,1-5H3,(H,40,41)
Reactome pathway
n/an/a 700n/an/an/an/an/an/a
Lilly Research Laboratories
Curated by ChEMBL
Assay Description
In vitro inhibition of mouse Peroxisome proliferator activated receptor alpha
Bioorg Med Chem Lett 14: 6113-6 (2004)
Article DOI: 10.1016/j.bmcl.2004.09.031
BindingDB Entry DOI: 10.7270/Q2QN67J1
Peroxisome proliferator-activated receptor alpha
(Mus musculus)
BDBM50156526
(3-{4-[2-(2-Biphenyl-4-yl-5-methyl-oxazol-4-yl)-eth...)
Show SMILES Cc1oc(nc1CCOc1ccc(CC(C)(Oc2ccc(cc2)C(C)(C)C)C(O)=O)cc1)-c1ccc(cc1)-c1ccccc1
Show InChI InChI=1S/C38H39NO5/c1-26-34(39-35(43-26)30-15-13-29(14-16-30)28-9-7-6-8-10-28)23-24-42-32-19-11-27(12-20-32)25-38(5,36(40)41)44-33-21-17-31(18-22-33)37(2,3)4/h6-22H,23-25H2,1-5H3,(H,40,41)
Reactome pathway
n/an/an/an/a 1.17E+3n/an/an/an/a
Lilly Research Laboratories
Curated by ChEMBL
Assay Description
Transactivation activity for mouse Peroxisome proliferator activated receptor alpha
Bioorg Med Chem Lett 14: 6113-6 (2004)
Article DOI: 10.1016/j.bmcl.2004.09.031
BindingDB Entry DOI: 10.7270/Q2QN67J1