null
SMILES: COCCn1cc(C2CCN(CCOc3ccccc3C(O)=O)CC2)c2ccccc12
InChI Key: InChIKey=LVAJRQDSXRFOTR-UHFFFAOYSA-N
Activity Spreadsheet -- Enzyme Inhibition Constant Data from BindingDB
Found 2 hits for monomerid = 50156853
Trg + Lig
Ki
nM
ΔG°
kcal/mole
IC50
nM
Kd
nM
EC50/IC50
nM
koff
s-1
kon
M-1s-1
pHTemp
°C
Histamine H1 receptor
(Cavia porcellus (domestic guinea pig))
BDBM50156853
(2-(2-(4-(1-(2-methoxyethyl)-1H-indol-3-yl)piperidi...)
Show SMILES COCCn1cc(C2CCN(CCOc3ccccc3C(O)=O)CC2)c2ccccc12
Show InChI InChI=1S/C25H30N2O4/c1-30-16-15-27-18-22(20-6-2-4-8-23(20)27)19-10-12-26(13-11-19)14-17-31-24-9-5-3-7-21(24)25(28)29/h2-9,18-19H,10-17H2,1H3,(H,28,29)
n/an/a 83n/an/an/an/an/an/a
Rhône-Poulenc Rorer
Curated by ChEMBL
Assay Description
Displacement of [3H]mepyramine from histamine H1 receptor in guinea pig cerebellum membranes
J Med Chem 47: 6326-37 (2004)
Article DOI: 10.1021/jm0498203
BindingDB Entry DOI: 10.7270/Q2HM57XC
Histamine H2 receptor
(Homo sapiens (Human))
BDBM50156853
(2-(2-(4-(1-(2-methoxyethyl)-1H-indol-3-yl)piperidi...)
Show SMILES COCCn1cc(C2CCN(CCOc3ccccc3C(O)=O)CC2)c2ccccc12
Show InChI InChI=1S/C25H30N2O4/c1-30-16-15-27-18-22(20-6-2-4-8-23(20)27)19-10-12-26(13-11-19)14-17-31-24-9-5-3-7-21(24)25(28)29/h2-9,18-19H,10-17H2,1H3,(H,28,29)
Reactome pathway
n/an/a>1.00E+4n/an/an/an/an/an/a
Rhône-Poulenc Rorer
Curated by ChEMBL
Assay Description
Displacement of [3H]ketanserine from histamine H2 receptor in human cortex membranes
J Med Chem 47: 6326-37 (2004)
Article DOI: 10.1021/jm0498203
BindingDB Entry DOI: 10.7270/Q2HM57XC