null
SMILES: CCOCCn1cc(C2CCN(CCOc3ccsc3C(O)=O)CC2)c2ccccc12
InChI Key: InChIKey=FMCRHCCYFCVMCE-UHFFFAOYSA-N
Activity Spreadsheet -- Enzyme Inhibition Constant Data from BindingDB
Found 1 hit for monomerid = 50156897
Trg + Lig
Ki
nM
ΔG°
kcal/mole
IC50
nM
Kd
nM
EC50/IC50
nM
koff
s-1
kon
M-1s-1
pHTemp
°C
Histamine H1 receptor
(Cavia porcellus (domestic guinea pig))
BDBM50156897
(3-(2-(4-(1-(2-ethoxyethyl)-1H-indol-3-yl)piperidin...)
Show SMILES CCOCCn1cc(C2CCN(CCOc3ccsc3C(O)=O)CC2)c2ccccc12
Show InChI InChI=1S/C24H30N2O4S/c1-2-29-14-13-26-17-20(19-5-3-4-6-21(19)26)18-7-10-25(11-8-18)12-15-30-22-9-16-31-23(22)24(27)28/h3-6,9,16-18H,2,7-8,10-15H2,1H3,(H,27,28)
n/an/a 100n/an/an/an/an/an/a
Rhône-Poulenc Rorer
Curated by ChEMBL
Assay Description
Displacement of [3H]mepyramine from histamine H1 receptor in guinea pig cerebellum membranes
J Med Chem 47: 6326-37 (2004)
Article DOI: 10.1021/jm0498203
BindingDB Entry DOI: 10.7270/Q2HM57XC