BDBM50156917 (2R,3S)-methyl 3-(4-iodophenyl)-8-methyl-8-aza-bicyclo[3.2.1]octane-2-carboxylate::(2S,3R)-methyl 3-(4-iodophenyl)-8-methyl-8-aza-bicyclo[3.2.1]octane-2-carboxylate::CHEMBL375889
SMILES: COC(=O)[C@@H]1C2CCC(C[C@H]1c1ccc(I)cc1)N2C
InChI Key: InChIKey=SIIICDNNMDMWCI-SHWKFHJASA-N
Data: 2 KI  3 IC50
Activity Spreadsheet -- Enzyme Inhibition Constant Data from BindingDB
Found 5 hits for monomerid = 50156917
Trg + Lig
Ki
nM
ΔG°
kcal/mole
IC50
nM
Kd
nM
EC50/IC50
nM
koff
s-1
kon
M-1s-1
pHTemp
°C
Sodium-dependent serotonin transporter
(Homo sapiens (Human))
BDBM50156917
((2R,3S)-methyl 3-(4-iodophenyl)-8-methyl-8-aza-bic...)
Show SMILES COC(=O)[C@@H]1C2CCC(C[C@H]1c1ccc(I)cc1)N2C |r,THB:2:4:18:6.7|
Show InChI InChI=1S/C16H20INO2/c1-18-12-7-8-14(18)15(16(19)20-2)13(9-12)10-3-5-11(17)6-4-10/h3-6,12-15H,7-9H2,1-2H3/t12?,13-,14?,15-/m0/s1
5.90n/an/an/an/an/an/an/an/a
Research Triangle Institute
Curated by ChEMBL
Assay Description
Displacement of [3H]paroxetine from 5HTT
J Med Chem 47: 6401-9 (2004)
Article DOI: 10.1021/jm0401311
BindingDB Entry DOI: 10.7270/Q2W37X4B
Sodium-dependent noradrenaline transporter
(Homo sapiens (Human))
BDBM50156917
((2R,3S)-methyl 3-(4-iodophenyl)-8-methyl-8-aza-bic...)
Show SMILES COC(=O)[C@@H]1C2CCC(C[C@H]1c1ccc(I)cc1)N2C |r,THB:2:4:18:6.7|
Show InChI InChI=1S/C16H20INO2/c1-18-12-7-8-14(18)15(16(19)20-2)13(9-12)10-3-5-11(17)6-4-10/h3-6,12-15H,7-9H2,1-2H3/t12?,13-,14?,15-/m0/s1
Reactome pathway
32n/an/an/an/an/an/an/an/a
Research Triangle Institute
Curated by ChEMBL
Assay Description
Displacement of [3H]nisoxetine from NET
J Med Chem 47: 6401-9 (2004)
Article DOI: 10.1021/jm0401311
BindingDB Entry DOI: 10.7270/Q2W37X4B
Sodium-dependent serotonin transporter
(Homo sapiens (Human))
BDBM50156917
((2R,3S)-methyl 3-(4-iodophenyl)-8-methyl-8-aza-bic...)
Show SMILES COC(=O)[C@@H]1C2CCC(C[C@H]1c1ccc(I)cc1)N2C |r,THB:2:4:18:6.7|
Show InChI InChI=1S/C16H20INO2/c1-18-12-7-8-14(18)15(16(19)20-2)13(9-12)10-3-5-11(17)6-4-10/h3-6,12-15H,7-9H2,1-2H3/t12?,13-,14?,15-/m0/s1
n/an/a 64.9n/an/an/an/an/an/a
Research Triangle Institute
Curated by ChEMBL
Assay Description
Displacement of [3H]paroxetine from 5HTT
J Med Chem 47: 6401-9 (2004)
Article DOI: 10.1021/jm0401311
BindingDB Entry DOI: 10.7270/Q2W37X4B
Sodium-dependent dopamine transporter
(Homo sapiens (Human))
BDBM50156917
((2R,3S)-methyl 3-(4-iodophenyl)-8-methyl-8-aza-bic...)
Show SMILES COC(=O)[C@@H]1C2CCC(C[C@H]1c1ccc(I)cc1)N2C |r,THB:2:4:18:6.7|
Show InChI InChI=1S/C16H20INO2/c1-18-12-7-8-14(18)15(16(19)20-2)13(9-12)10-3-5-11(17)6-4-10/h3-6,12-15H,7-9H2,1-2H3/t12?,13-,14?,15-/m0/s1
NCI pathway
Reactome pathway
n/an/a 2.90n/an/an/an/an/an/a
Research Triangle Institute
Curated by ChEMBL
Assay Description
Displacement of [3H]WIN-35428 from DAT
J Med Chem 47: 6401-9 (2004)
Article DOI: 10.1021/jm0401311
BindingDB Entry DOI: 10.7270/Q2W37X4B
Sodium-dependent noradrenaline transporter
(Homo sapiens (Human))
BDBM50156917
((2R,3S)-methyl 3-(4-iodophenyl)-8-methyl-8-aza-bic...)
Show SMILES COC(=O)[C@@H]1C2CCC(C[C@H]1c1ccc(I)cc1)N2C |r,THB:2:4:18:6.7|
Show InChI InChI=1S/C16H20INO2/c1-18-12-7-8-14(18)15(16(19)20-2)13(9-12)10-3-5-11(17)6-4-10/h3-6,12-15H,7-9H2,1-2H3/t12?,13-,14?,15-/m0/s1
Reactome pathway
n/an/a 52.4n/an/an/an/an/an/a
Research Triangle Institute
Curated by ChEMBL
Assay Description
Displacement of [3H]nisoxetine from NET
J Med Chem 47: 6401-9 (2004)
Article DOI: 10.1021/jm0401311
BindingDB Entry DOI: 10.7270/Q2W37X4B