BDBM50156931 CHEMBL3793033
SMILES: Clc1ccc(CN2CCO[C@H](COc3cccnc3)C2)cc1
InChI Key: InChIKey=NOMURQDOWZMQDC-KRWDZBQOSA-N
Data: 1 KI  1 IC50
Activity Spreadsheet -- Enzyme Inhibition Constant Data from BindingDB
Found 2 hits for monomerid = 50156931
Trg + Lig
Ki
nM
ΔG°
kcal/mole
IC50
nM
Kd
nM
EC50/IC50
nM
koff
s-1
kon
M-1s-1
pHTemp
°C
D(4) dopamine receptor
(Homo sapiens (Human))
BDBM50156931
(CHEMBL3793033)
Show SMILES Clc1ccc(CN2CCO[C@H](COc3cccnc3)C2)cc1 |r|
Show InChI InChI=1S/C17H19ClN2O2/c18-15-5-3-14(4-6-15)11-20-8-9-21-17(12-20)13-22-16-2-1-7-19-10-16/h1-7,10,17H,8-9,11-13H2/t17-/m0/s1
Reactome pathway
47n/an/an/an/an/an/an/an/a
Vanderbilt University
Curated by ChEMBL
Assay Description
Displacement of [3H]-Spiperone from human recombinant dopamine D4 receptor expressed in CHOK1 cells
Bioorg Med Chem Lett 26: 2481-8 (2016)
BindingDB Entry DOI: 10.7270/Q2G44S5M
D(4) dopamine receptor
(Homo sapiens (Human))
BDBM50156931
(CHEMBL3793033)
Show SMILES Clc1ccc(CN2CCO[C@H](COc3cccnc3)C2)cc1 |r|
Show InChI InChI=1S/C17H19ClN2O2/c18-15-5-3-14(4-6-15)11-20-8-9-21-17(12-20)13-22-16-2-1-7-19-10-16/h1-7,10,17H,8-9,11-13H2/t17-/m0/s1
Reactome pathway
n/an/a 103n/an/an/an/an/an/a
Vanderbilt University
Curated by ChEMBL
Assay Description
Displacement of [3H]-Spiperone from human recombinant dopamine D4 receptor expressed in CHOK1 cells
Bioorg Med Chem Lett 26: 2481-8 (2016)
BindingDB Entry DOI: 10.7270/Q2G44S5M