BDBM50156933 CHEMBL3793782
SMILES: Fc1ccc2c(CN3CCO[C@H](COc4ccccc4)C3)c[nH]c2c1
InChI Key: InChIKey=RBBZCGHPFRVKOO-SFHVURJKSA-N
Data: 1 KI  1 IC50
Activity Spreadsheet -- Enzyme Inhibition Constant Data from BindingDB
Found 2 hits for monomerid = 50156933
Trg + Lig
Ki
nM
ΔG°
kcal/mole
IC50
nM
Kd
nM
EC50/IC50
nM
koff
s-1
kon
M-1s-1
pHTemp
°C
D(4) dopamine receptor
(Homo sapiens (Human))
BDBM50156933
(CHEMBL3793782)
Show SMILES Fc1ccc2c(CN3CCO[C@H](COc4ccccc4)C3)c[nH]c2c1 |r|
Show InChI InChI=1S/C20H21FN2O2/c21-16-6-7-19-15(11-22-20(19)10-16)12-23-8-9-24-18(13-23)14-25-17-4-2-1-3-5-17/h1-7,10-11,18,22H,8-9,12-14H2/t18-/m0/s1
Reactome pathway
5.20n/an/an/an/an/an/an/an/a
Vanderbilt University
Curated by ChEMBL
Assay Description
Displacement of [3H]-Spiperone from human recombinant dopamine D4 receptor expressed in CHOK1 cells
Bioorg Med Chem Lett 26: 2481-8 (2016)
BindingDB Entry DOI: 10.7270/Q2G44S5M
D(4) dopamine receptor
(Homo sapiens (Human))
BDBM50156933
(CHEMBL3793782)
Show SMILES Fc1ccc2c(CN3CCO[C@H](COc4ccccc4)C3)c[nH]c2c1 |r|
Show InChI InChI=1S/C20H21FN2O2/c21-16-6-7-19-15(11-22-20(19)10-16)12-23-8-9-24-18(13-23)14-25-17-4-2-1-3-5-17/h1-7,10-11,18,22H,8-9,12-14H2/t18-/m0/s1
Reactome pathway
n/an/a 19n/an/an/an/an/an/a
Vanderbilt University
Curated by ChEMBL
Assay Description
Displacement of [3H]-Spiperone from human recombinant dopamine D4 receptor expressed in CHOK1 cells
Bioorg Med Chem Lett 26: 2481-8 (2016)
BindingDB Entry DOI: 10.7270/Q2G44S5M