BDBM50156941 CHEMBL3793438
SMILES: C(Oc1ccccc1)[C@@H]1CN(Cc2ccc3[nH]ccc3c2)CCO1
InChI Key: InChIKey=XHIUVRDSBNUEMG-IBGZPJMESA-N
Data: 1 KI  1 IC50
Activity Spreadsheet -- Enzyme Inhibition Constant Data from BindingDB
Found 2 hits for monomerid = 50156941
Trg + Lig
Ki
nM
ΔG°
kcal/mole
IC50
nM
Kd
nM
EC50/IC50
nM
koff
s-1
kon
M-1s-1
pHTemp
°C
D(4) dopamine receptor
(Homo sapiens (Human))
BDBM50156941
(CHEMBL3793438)
Show SMILES C(Oc1ccccc1)[C@@H]1CN(Cc2ccc3[nH]ccc3c2)CCO1 |r|
Show InChI InChI=1S/C20H22N2O2/c1-2-4-18(5-3-1)24-15-19-14-22(10-11-23-19)13-16-6-7-20-17(12-16)8-9-21-20/h1-9,12,19,21H,10-11,13-15H2/t19-/m0/s1
Reactome pathway
16n/an/an/an/an/an/an/an/a
Vanderbilt University
Curated by ChEMBL
Assay Description
Displacement of [3H]-Spiperone from human recombinant dopamine D4 receptor expressed in CHOK1 cells
Bioorg Med Chem Lett 26: 2481-8 (2016)
BindingDB Entry DOI: 10.7270/Q2G44S5M
D(4) dopamine receptor
(Homo sapiens (Human))
BDBM50156941
(CHEMBL3793438)
Show SMILES C(Oc1ccccc1)[C@@H]1CN(Cc2ccc3[nH]ccc3c2)CCO1 |r|
Show InChI InChI=1S/C20H22N2O2/c1-2-4-18(5-3-1)24-15-19-14-22(10-11-23-19)13-16-6-7-20-17(12-16)8-9-21-20/h1-9,12,19,21H,10-11,13-15H2/t19-/m0/s1
Reactome pathway
n/an/a 58n/an/an/an/an/an/a
Vanderbilt University
Curated by ChEMBL
Assay Description
Displacement of [3H]-Spiperone from human recombinant dopamine D4 receptor expressed in CHOK1 cells
Bioorg Med Chem Lett 26: 2481-8 (2016)
BindingDB Entry DOI: 10.7270/Q2G44S5M