BDBM50157032 CHEMBL369311::N-[1-(3,3-Diphenyl-propyl)-piperidin-4-yl]-N-ethyl-2-(4-methanesulfonyl-phenyl)-acetamide
SMILES: CCN(C1CCN(CCC(c2ccccc2)c2ccccc2)CC1)C(=O)Cc1ccc(cc1)S(C)(=O)=O
InChI Key: InChIKey=FBCOMGDKGBJAAS-UHFFFAOYSA-N
Data: 2 IC50
Activity Spreadsheet -- Enzyme Inhibition Constant Data from BindingDB
Found 2 hits for monomerid = 50157032
Trg + Lig
Ki
nM
ΔG°
kcal/mole
IC50
nM
Kd
nM
EC50/IC50
nM
koff
s-1
kon
M-1s-1
pHTemp
°C
C-C chemokine receptor type 5
(Homo sapiens (Human))
BDBM50157032
(CHEMBL369311 | N-[1-(3,3-Diphenyl-propyl)-piperidi...)
Show SMILES CCN(C1CCN(CCC(c2ccccc2)c2ccccc2)CC1)C(=O)Cc1ccc(cc1)S(C)(=O)=O
Show InChI InChI=1S/C31H38N2O3S/c1-3-33(31(34)24-25-14-16-29(17-15-25)37(2,35)36)28-18-21-32(22-19-28)23-20-30(26-10-6-4-7-11-26)27-12-8-5-9-13-27/h4-17,28,30H,3,18-24H2,1-2H3
n/an/a 18n/an/an/an/an/an/a
AstraZeneca
Curated by ChEMBL
Assay Description
Displacement of [125I]-MIP-1 alpha from human C-C chemokine receptor type 5 expressed in CHO cells
Bioorg Med Chem Lett 15: 5012-5 (2005)
Article DOI: 10.1016/j.bmcl.2005.08.014
BindingDB Entry DOI: 10.7270/Q23R0SFG
C-C chemokine receptor type 5
(Homo sapiens (Human))
BDBM50157032
(CHEMBL369311 | N-[1-(3,3-Diphenyl-propyl)-piperidi...)
Show SMILES CCN(C1CCN(CCC(c2ccccc2)c2ccccc2)CC1)C(=O)Cc1ccc(cc1)S(C)(=O)=O
Show InChI InChI=1S/C31H38N2O3S/c1-3-33(31(34)24-25-14-16-29(17-15-25)37(2,35)36)28-18-21-32(22-19-28)23-20-30(26-10-6-4-7-11-26)27-12-8-5-9-13-27/h4-17,28,30H,3,18-24H2,1-2H3
n/an/a 76n/an/an/an/an/an/a
AstraZeneca
Curated by ChEMBL
Assay Description
Binding of [125I]-RANTES to membranes prepared from chinese hamster ovary (CHO) cells stably expressing recombinant human C-C chemokine receptor type...
Bioorg Med Chem Lett 15: 25-8 (2004)
Article DOI: 10.1016/j.bmcl.2004.10.044
BindingDB Entry DOI: 10.7270/Q2833RJJ