BDBM50157445 3-[4-(2,6-Dichloro-benzoylamino)-phenyl]-2-{3-[(2,2-dimethyl-propionyl)-isobutyl-amino]-4-propoxy-phenyl}-propionic acid::CHEMBL182181
SMILES: CCCOc1ccc(cc1N(CC(C)C)C(=O)C(C)(C)C)C(Cc1ccc(NC(=O)c2c(Cl)cccc2Cl)cc1)C(O)=O
InChI Key: InChIKey=QLEPVYXTIMUWHF-UHFFFAOYSA-N
Data: 1 IC50
Activity Spreadsheet -- Enzyme Inhibition Constant Data from BindingDB
Found 1 hit for monomerid = 50157445
Trg + Lig
Ki
nM
ΔG°
kcal/mole
IC50
nM
Kd
nM
EC50/IC50
nM
koff
s-1
kon
M-1s-1
pHTemp
°C
Fibronectin receptor beta/Integrin alpha-4
(Homo sapiens (Human))
BDBM50157445
(3-[4-(2,6-Dichloro-benzoylamino)-phenyl]-2-{3-[(2,...)
Show SMILES CCCOc1ccc(cc1N(CC(C)C)C(=O)C(C)(C)C)C(Cc1ccc(NC(=O)c2c(Cl)cccc2Cl)cc1)C(O)=O
Show InChI InChI=1S/C34H40Cl2N2O5/c1-7-17-43-29-16-13-23(19-28(29)38(20-21(2)3)33(42)34(4,5)6)25(32(40)41)18-22-11-14-24(15-12-22)37-31(39)30-26(35)9-8-10-27(30)36/h8-16,19,21,25H,7,17-18,20H2,1-6H3,(H,37,39)(H,40,41)
Reactome pathway
n/an/a 0.100n/an/an/an/an/an/a
Kaken Pharmaceutical Co. Ltd
Curated by ChEMBL
Assay Description
Inhibition of Very late antigen-4 (VLA-4) expressing human leukemia cells (HL-60) aggregation with human Vascular cell adhesion molecule-1 (VCAM-1) e...
Bioorg Med Chem Lett 15: 217-20 (2004)
Article DOI: 10.1016/j.bmcl.2004.09.089
BindingDB Entry DOI: 10.7270/Q27945Z1