null
SMILES: CC(C)n1nc(-c2ccc(O)cc2C)c2cccc(c12)C(F)(F)F
InChI Key: InChIKey=KHSAABIGSPXJBL-UHFFFAOYSA-N
Activity Spreadsheet -- Enzyme Inhibition Constant Data from BindingDB
Found 1 hit for monomerid = 50157501
Trg + Lig
Ki
nM
ΔG°
kcal/mole
IC50
nM
Kd
nM
EC50/IC50
nM
koff
s-1
kon
M-1s-1
pHTemp
°C
Estrogen receptor
(Homo sapiens (Human))
BDBM50157501
(4-[1-isopropyl-7-(trifluoromethyl)-1H-indazol-3-yl...)
Show SMILES CC(C)n1nc(-c2ccc(O)cc2C)c2cccc(c12)C(F)(F)F
Show InChI InChI=1S/C18H17F3N2O/c1-10(2)23-17-14(5-4-6-15(17)18(19,20)21)16(22-23)13-8-7-12(24)9-11(13)3/h4-10,24H,1-3H3
n/an/a 20n/an/an/an/an/an/a
Wyeth Research
Curated by ChEMBL
Assay Description
Activity at human ERalpha expressed in HAECT1 cells assessed as inhibition of NFkappaB transcription
J Med Chem 47: 6435-8 (2004)
Article DOI: 10.1021/jm049194+
BindingDB Entry DOI: 10.7270/Q2639P7B