BDBM50157502 4-(7-chloro-1-propyl-1H-indazol-3-yl)phenol::CHEMBL222453
SMILES: CCCn1nc(-c2ccc(O)cc2)c2cccc(Cl)c12
InChI Key: InChIKey=OEWGFWIYFTVVAZ-UHFFFAOYSA-N
Data: 1 IC50  1 EC50
Activity Spreadsheet -- Enzyme Inhibition Constant Data from BindingDB
Found 2 hits for monomerid = 50157502
Trg + Lig
Ki
nM
ΔG°
kcal/mole
IC50
nM
Kd
nM
EC50/IC50
nM
koff
s-1
kon
M-1s-1
pHTemp
°C
Estrogen receptor
(Homo sapiens (Human))
BDBM50157502
(4-(7-chloro-1-propyl-1H-indazol-3-yl)phenol | CHEM...)
Show SMILES CCCn1nc(-c2ccc(O)cc2)c2cccc(Cl)c12
Show InChI InChI=1S/C16H15ClN2O/c1-2-10-19-16-13(4-3-5-14(16)17)15(18-19)11-6-8-12(20)9-7-11/h3-9,20H,2,10H2,1H3
n/an/an/an/a 138n/an/an/an/a
Wyeth Research
Curated by ChEMBL
Assay Description
Activity at human ERalpha expressed in HAECT1 cells assessed as stimulation of creatine kinase activity
J Med Chem 47: 6435-8 (2004)
Article DOI: 10.1021/jm049194+
BindingDB Entry DOI: 10.7270/Q2639P7B
Estrogen receptor
(Homo sapiens (Human))
BDBM50157502
(4-(7-chloro-1-propyl-1H-indazol-3-yl)phenol | CHEM...)
Show SMILES CCCn1nc(-c2ccc(O)cc2)c2cccc(Cl)c12
Show InChI InChI=1S/C16H15ClN2O/c1-2-10-19-16-13(4-3-5-14(16)17)15(18-19)11-6-8-12(20)9-7-11/h3-9,20H,2,10H2,1H3
n/an/a 52n/an/an/an/an/an/a
Wyeth Research
Curated by ChEMBL
Assay Description
Activity at human ERalpha expressed in HAECT1 cells assessed as inhibition of NFkappaB transcription
J Med Chem 47: 6435-8 (2004)
Article DOI: 10.1021/jm049194+
BindingDB Entry DOI: 10.7270/Q2639P7B