BDBM50157508 4-[1-(3-chlorophenyl)-6-hydroxy-1H-indazol-3-yl]benzene-1,3-diol::CHEMBL434577
SMILES: Oc1ccc(-c2nn(-c3cccc(Cl)c3)c3cc(O)ccc23)c(O)c1
InChI Key: InChIKey=CJPNXLZTRUTXTI-UHFFFAOYSA-N
Data: 1 IC50
Activity Spreadsheet -- Enzyme Inhibition Constant Data from BindingDB
Found 1 hit for monomerid = 50157508
Trg + Lig
Ki
nM
ΔG°
kcal/mole
IC50
nM
Kd
nM
EC50/IC50
nM
koff
s-1
kon
M-1s-1
pHTemp
°C
Estrogen receptor
(Homo sapiens (Human))
BDBM50157508
(4-[1-(3-chlorophenyl)-6-hydroxy-1H-indazol-3-yl]be...)
Show SMILES Oc1ccc(-c2nn(-c3cccc(Cl)c3)c3cc(O)ccc23)c(O)c1
Show InChI InChI=1S/C19H13ClN2O3/c20-11-2-1-3-12(8-11)22-17-9-13(23)4-6-15(17)19(21-22)16-7-5-14(24)10-18(16)25/h1-10,23-25H
n/an/a 50n/an/an/an/an/an/a
Wyeth Research
Curated by ChEMBL
Assay Description
Activity at human ERalpha expressed in HAECT1 cells assessed as inhibition of NFkappaB transcription
J Med Chem 47: 6435-8 (2004)
Article DOI: 10.1021/jm049194+
BindingDB Entry DOI: 10.7270/Q2639P7B