BDBM50157694 (5R,6Z)-6-[(7-fluoroimidazo[2,1-b][1,3]-benzothiazol-2-ylmethylene)-7-oxo-4-thia-1-azabicyclo-[3.2.0]hept-2-ene-2-carboxylic acid sodium::CHEMBL222922
SMILES: Fc1ccc2c(c1)sc1nc(\C=C3/[C@H]4SC=C(N4C3=O)C(=O)O[Na])cn21
InChI Key: InChIKey=HUPHEXATWXVGJT-DEJRPRKJSA-M
Data: 3 IC50
Activity Spreadsheet -- Enzyme Inhibition Constant Data from BindingDB
Found 3 hits for monomerid = 50157694
Trg + Lig
Ki
nM
ΔG°
kcal/mole
IC50
nM
Kd
nM
EC50/IC50
nM
koff
s-1
kon
M-1s-1
pHTemp
°C
Beta-lactamase type II
(Bacteroides fragilis)
BDBM50157694
((5R,6Z)-6-[(7-fluoroimidazo[2,1-b][1,3]-benzothiaz...)
Show SMILES Fc1ccc2c(c1)sc1nc(\C=C3/[C@H]4SC=C(N4C3=O)C(=O)O[Na])cn21 |r,c:16|
Show InChI InChI=1S/C16H8FN3O3S2.Na/c17-7-1-2-10-12(3-7)25-16-18-8(5-19(10)16)4-9-13(21)20-11(15(22)23)6-24-14(9)20;/h1-6,14H,(H,22,23);/q;+1/p-1/b9-4-;/t14-;/m1./s1
NCI pathway
Reactome pathway
n/an/a 370n/an/an/an/an/an/a
Wyeth Research
Curated by ChEMBL
Assay Description
Inhibition of Bacteroides fragilis CcrA
J Med Chem 47: 6556-68 (2004)
Article DOI: 10.1021/jm049680x
BindingDB Entry DOI: 10.7270/Q2542N22
Beta-lactamase (TEM-1)
(Escherichia coli)
BDBM50157694
((5R,6Z)-6-[(7-fluoroimidazo[2,1-b][1,3]-benzothiaz...)
Show SMILES Fc1ccc2c(c1)sc1nc(\C=C3/[C@H]4SC=C(N4C3=O)C(=O)O[Na])cn21 |r,c:16|
Show InChI InChI=1S/C16H8FN3O3S2.Na/c17-7-1-2-10-12(3-7)25-16-18-8(5-19(10)16)4-9-13(21)20-11(15(22)23)6-24-14(9)20;/h1-6,14H,(H,22,23);/q;+1/p-1/b9-4-;/t14-;/m1./s1
n/an/a 8n/an/an/an/an/an/a
Wyeth Research
Curated by ChEMBL
Assay Description
Inhibition of Escherichia coli TEM1
J Med Chem 47: 6556-68 (2004)
Article DOI: 10.1021/jm049680x
BindingDB Entry DOI: 10.7270/Q2542N22
Beta-lactamase
(Enterobacter cloacae)
BDBM50157694
((5R,6Z)-6-[(7-fluoroimidazo[2,1-b][1,3]-benzothiaz...)
Show SMILES Fc1ccc2c(c1)sc1nc(\C=C3/[C@H]4SC=C(N4C3=O)C(=O)O[Na])cn21 |r,c:16|
Show InChI InChI=1S/C16H8FN3O3S2.Na/c17-7-1-2-10-12(3-7)25-16-18-8(5-19(10)16)4-9-13(21)20-11(15(22)23)6-24-14(9)20;/h1-6,14H,(H,22,23);/q;+1/p-1/b9-4-;/t14-;/m1./s1
n/an/a 2n/an/an/an/an/an/a
Wyeth Research
Curated by ChEMBL
Assay Description
Inhibition of Enterobacter cloacae AmpC
J Med Chem 47: 6556-68 (2004)
Article DOI: 10.1021/jm049680x
BindingDB Entry DOI: 10.7270/Q2542N22