BDBM50157836 7-Benzyl-3-hydroxy-1H-furo[3,2-d]pyrimidine-2,4-dione::CHEMBL183133
SMILES: On1c(=O)[nH]c2c(Cc3ccccc3)coc2c1=O
InChI Key: InChIKey=ZTYGZYOHPCUUJF-UHFFFAOYSA-N
Data: 2 IC50
Activity Spreadsheet -- Enzyme Inhibition Constant Data from BindingDB
Found 2 hits for monomerid = 50157836
Trg + Lig
Ki
nM
ΔG°
kcal/mole
IC50
nM
Kd
nM
EC50/IC50
nM
koff
s-1
kon
M-1s-1
pHTemp
°C
DNA excision repair protein ERCC-5
(Homo sapiens (Human))
BDBM50157836
(7-Benzyl-3-hydroxy-1H-furo[3,2-d]pyrimidine-2,4-di...)
Show SMILES On1c(=O)[nH]c2c(Cc3ccccc3)coc2c1=O
Show InChI InChI=1S/C13H10N2O4/c16-12-11-10(14-13(17)15(12)18)9(7-19-11)6-8-4-2-1-3-5-8/h1-5,7,18H,6H2,(H,14,17)
Reactome pathway
n/an/a 0.0610n/an/an/an/an/an/a
Athersys, Inc.
Curated by ChEMBL
Assay Description
Inhibitory concentration against the xeroderma pigmentosum G
Bioorg Med Chem Lett 15: 277-81 (2004)
Article DOI: 10.1016/j.bmcl.2004.10.086
BindingDB Entry DOI: 10.7270/Q2HD7V46
Flap endonuclease 1
(Homo sapiens (Human))
BDBM50157836
(7-Benzyl-3-hydroxy-1H-furo[3,2-d]pyrimidine-2,4-di...)
Show SMILES On1c(=O)[nH]c2c(Cc3ccccc3)coc2c1=O
Show InChI InChI=1S/C13H10N2O4/c16-12-11-10(14-13(17)15(12)18)9(7-19-11)6-8-4-2-1-3-5-8/h1-5,7,18H,6H2,(H,14,17)
Reactome pathway
n/an/a 0.0380n/an/an/an/an/an/a
Athersys, Inc.
Curated by ChEMBL
Assay Description
Inhibitory concentration against the Flap endonuclease-1
Bioorg Med Chem Lett 15: 277-81 (2004)
Article DOI: 10.1016/j.bmcl.2004.10.086
BindingDB Entry DOI: 10.7270/Q2HD7V46