BDBM50158068 (2S,6R)-4-(4-Bromo-3-methyl-phenyl)-4-aza-tricyclo[5.2.1.0*2,6*]dec-8-ene-3,5-dione::CHEMBL182236
SMILES: Cc1cc(ccc1Br)-n1c(O)c2C3CC(C=C3)c2c1O
InChI Key: InChIKey=IWPFPWFVJKESEG-UHFFFAOYSA-N
Data: 2 KI  1 IC50
Activity Spreadsheet -- Enzyme Inhibition Constant Data from BindingDB
Found 3 hits for monomerid = 50158068
Trg + Lig
Ki
nM
ΔG°
kcal/mole
IC50
nM
Kd
nM
EC50/IC50
nM
koff
s-1
kon
M-1s-1
pHTemp
°C
Androgen Receptor
(Homo sapiens (Human))
BDBM50158068
((2S,6R)-4-(4-Bromo-3-methyl-phenyl)-4-aza-tricyclo...)
Show SMILES Cc1cc(ccc1Br)-n1c(O)c2C3CC(C=C3)c2c1O |c:16,THB:9:11:15.16:13|
Show InChI InChI=1S/C16H14BrNO2/c1-8-6-11(4-5-12(8)17)18-15(19)13-9-2-3-10(7-9)14(13)16(18)20/h2-6,9-10,19-20H,7H2,1H3
NCI pathway
Reactome pathway
3.60n/an/an/an/an/an/an/an/a
Bristol-Myers Squibb Pharmaceutical Research Institute
Curated by ChEMBL
Assay Description
Inhibition of [3H]-DHT binding to T877A androgen receptor of LNCaP cells
Bioorg Med Chem Lett 15: 389-93 (2004)
Article DOI: 10.1016/j.bmcl.2004.10.051
BindingDB Entry DOI: 10.7270/Q2QZ29GJ
Androgen Receptor
(Homo sapiens (Human))
BDBM50158068
((2S,6R)-4-(4-Bromo-3-methyl-phenyl)-4-aza-tricyclo...)
Show SMILES Cc1cc(ccc1Br)-n1c(O)c2C3CC(C=C3)c2c1O |c:16,THB:9:11:15.16:13|
Show InChI InChI=1S/C16H14BrNO2/c1-8-6-11(4-5-12(8)17)18-15(19)13-9-2-3-10(7-9)14(13)16(18)20/h2-6,9-10,19-20H,7H2,1H3
NCI pathway
Reactome pathway
125n/an/an/an/an/an/an/an/a
Bristol-Myers Squibb Pharmaceutical Research Institute
Curated by ChEMBL
Assay Description
Inhibition of [3H]-DHT binding to androgen receptor of MDA-453 cells
Bioorg Med Chem Lett 15: 389-93 (2004)
Article DOI: 10.1016/j.bmcl.2004.10.051
BindingDB Entry DOI: 10.7270/Q2QZ29GJ
Androgen Receptor
(Homo sapiens (Human))
BDBM50158068
((2S,6R)-4-(4-Bromo-3-methyl-phenyl)-4-aza-tricyclo...)
Show SMILES Cc1cc(ccc1Br)-n1c(O)c2C3CC(C=C3)c2c1O |c:16,THB:9:11:15.16:13|
Show InChI InChI=1S/C16H14BrNO2/c1-8-6-11(4-5-12(8)17)18-15(19)13-9-2-3-10(7-9)14(13)16(18)20/h2-6,9-10,19-20H,7H2,1H3
NCI pathway
Reactome pathway
n/an/a 220n/an/an/an/an/an/a
Bristol-Myers Squibb Pharmaceutical Research Institute
Curated by ChEMBL
Assay Description
Inhibition of human androgen receptor of breast carcinoma MDA-453 cells in reporter gene assay
Bioorg Med Chem Lett 15: 389-93 (2004)
Article DOI: 10.1016/j.bmcl.2004.10.051
BindingDB Entry DOI: 10.7270/Q2QZ29GJ