BDBM50158085 CHEMBL3781201
SMILES: CNCc1ccc(C)s1
InChI Key: InChIKey=XZPLAHRPQQWZFX-UHFFFAOYSA-N
Data: 1 IC50
Activity Spreadsheet -- Enzyme Inhibition Constant Data from BindingDB
Found 1 hit for monomerid = 50158085
Trg + Lig
Ki
nM
ΔG°
kcal/mole
IC50
nM
Kd
nM
EC50/IC50
nM
koff
s-1
kon
M-1s-1
pHTemp
°C
Protein arginine N-methyltransferase 6
(Homo sapiens (Human))
BDBM50158085
(CHEMBL3781201)
Show SMILES CNCc1ccc(C)s1
Show InChI InChI=1S/C7H11NS/c1-6-3-4-7(9-6)5-8-2/h3-4,8H,5H2,1-2H3
n/an/a 9.90E+4n/an/an/an/an/an/a
University of Toronto
Curated by ChEMBL
Assay Description
Inhibition of N-terminal hexa-His tagged human PRMT6 expressed in Sf9 cells using 24 residues of biotin labelled histone4 substrate and tritiated 3H-...
J Med Chem 59: 1176-83 (2016)
BindingDB Entry DOI: 10.7270/Q2SF2Z11