BDBM50158198 Aceticacid(R)-1-{(4R,4aR,5S,6R,6aR,11bS)-4,5,6-triacetoxy-1-[2-((R)-2-ethyl-phenyl)-pent-4-enyl]-1-hydroxy-2,4a,11b-trimethyl-1,2,3,4,4a,4b,5,6,9,11a,11b,12,13,13a-tetradecahydro-8-oxa-cyclohepta[a]phenanthren-6a-yl}-ethyl ester::CHEMBL360061
SMILES: CCc1ccccc1[C@H](CC=C)CC1(O)C2CC[C@@]3(C)C4C=CCOC[C@]4([C@@H](C)OC(C)=O)[C@@H](OC(C)=O)[C@@H](OC(C)=O)C3[C@@]2(C)[C@H](OC(C)=O)C=C1C
InChI Key: InChIKey=REUNWJMLSQCZCS-HYJDPPTMSA-N
Data: 1 IC50
Activity Spreadsheet -- Enzyme Inhibition Constant Data from BindingDB
Found 1 hit for monomerid = 50158198
Trg + Lig
Ki
nM
ΔG°
kcal/mole
IC50
nM
Kd
nM
EC50/IC50
nM
koff
s-1
kon
M-1s-1
pHTemp
°C
Voltage-gated potassium channel
(Homo sapiens (Human))
BDBM50158198
(Aceticacid(R)-1-{(4R,4aR,5S,6R,6aR,11bS)-4,5,6-tri...)
Show SMILES CCc1ccccc1[C@H](CC=C)CC1(O)C2CC[C@@]3(C)C4C=CCOC[C@]4([C@@H](C)OC(C)=O)[C@@H](OC(C)=O)[C@@H](OC(C)=O)C3[C@@]2(C)[C@H](OC(C)=O)C=C1C |c:22,55|
Show InChI InChI=1S/C44H60O10/c1-11-16-33(34-18-14-13-17-32(34)12-2)24-44(49)26(3)23-37(52-29(6)46)42(10)36(44)20-21-41(9)35-19-15-22-50-25-43(35,27(4)51-28(5)45)40(54-31(8)48)38(39(41)42)53-30(7)47/h11,13-15,17-19,23,27,33,35-40,49H,1,12,16,20-22,24-25H2,2-10H3/t27-,33-,35?,36?,37-,38+,39?,40+,41+,42-,43-,44?/m1/s1
Reactome pathway
n/an/a 48n/an/an/an/an/an/a
Merck Research Laboratories
Curated by ChEMBL
Assay Description
Inhibition of voltage-gated potassium channel subunit Kv1.3 in chinese hamster ovary cells
Bioorg Med Chem Lett 15: 447-51 (2004)
Article DOI: 10.1016/j.bmcl.2004.10.058
BindingDB Entry DOI: 10.7270/Q2BP0281