BDBM50158252 5-Chloro-1H-indole-2-carboxylic acid {[cyclopropylmethyl-(2-hydroxy-ethyl)-carbamoyl]-methyl}-amide::CHEMBL181455
SMILES: OCCN(CC1CC1)C(=O)CNC(=O)c1cc2cc(Cl)ccc2[nH]1
InChI Key: InChIKey=VXNFHMZOKAQUOK-UHFFFAOYSA-N
Data: 1 IC50
Activity Spreadsheet -- Enzyme Inhibition Constant Data from BindingDB
Found 1 hit for monomerid = 50158252
Trg + Lig
Ki
nM
ΔG°
kcal/mole
IC50
nM
Kd
nM
EC50/IC50
nM
koff
s-1
kon
M-1s-1
pHTemp
°C
Glycogen Phosphorylase (PYGL)
(Homo sapiens (Human))
BDBM50158252
(5-Chloro-1H-indole-2-carboxylic acid {[cyclopropyl...)
Show SMILES OCCN(CC1CC1)C(=O)CNC(=O)c1cc2cc(Cl)ccc2[nH]1
Show InChI InChI=1S/C17H20ClN3O3/c18-13-3-4-14-12(7-13)8-15(20-14)17(24)19-9-16(23)21(5-6-22)10-11-1-2-11/h3-4,7-8,11,20,22H,1-2,5-6,9-10H2,(H,19,24)
Reactome pathway
n/an/a 160n/an/an/an/an/an/a
Pfizer Global Research and Development
Curated by ChEMBL
Assay Description
Inhibitory concentration against glycogen phosphorylase
Bioorg Med Chem Lett 15: 459-65 (2004)
Article DOI: 10.1016/j.bmcl.2004.10.048
BindingDB Entry DOI: 10.7270/Q26W99K6