BDBM50158271 5-Chloro-1H-indole-2-carboxylic acid {[cyclodecyl-(2-hydroxy-ethyl)-carbamoyl]-methyl}-amide::CHEMBL179368
SMILES: OCCN(C1CCCCCCCCC1)C(=O)CNC(=O)c1cc2cc(Cl)ccc2[nH]1
InChI Key: InChIKey=NPNLVCHPHIKCNA-UHFFFAOYSA-N
Data: 1 IC50
Activity Spreadsheet -- Enzyme Inhibition Constant Data from BindingDB
Found 1 hit for monomerid = 50158271
Trg + Lig
Ki
nM
ΔG°
kcal/mole
IC50
nM
Kd
nM
EC50/IC50
nM
koff
s-1
kon
M-1s-1
pHTemp
°C
Glycogen Phosphorylase (PYGL)
(Homo sapiens (Human))
BDBM50158271
(5-Chloro-1H-indole-2-carboxylic acid {[cyclodecyl-...)
Show SMILES OCCN(C1CCCCCCCCC1)C(=O)CNC(=O)c1cc2cc(Cl)ccc2[nH]1
Show InChI InChI=1S/C23H32ClN3O3/c24-18-10-11-20-17(14-18)15-21(26-20)23(30)25-16-22(29)27(12-13-28)19-8-6-4-2-1-3-5-7-9-19/h10-11,14-15,19,26,28H,1-9,12-13,16H2,(H,25,30)
Reactome pathway
n/an/a 210n/an/an/an/an/an/a
Pfizer Global Research and Development
Curated by ChEMBL
Assay Description
Inhibitory concentration against glycogen phosphorylase
Bioorg Med Chem Lett 15: 459-65 (2004)
Article DOI: 10.1016/j.bmcl.2004.10.048
BindingDB Entry DOI: 10.7270/Q26W99K6