BDBM50158274 5-Chloro-1H-indole-2-carboxylic acid {[cyclohexyl-(2-hydroxy-ethyl)-carbamoyl]-methyl}-amide::CHEMBL362806
SMILES: OCCN(C1CCCCC1)C(=O)CNC(=O)c1cc2cc(Cl)ccc2[nH]1
InChI Key: InChIKey=PMNZEIZAMSPOMZ-UHFFFAOYSA-N
Data: 1 IC50
Activity Spreadsheet -- Enzyme Inhibition Constant Data from BindingDB
Found 1 hit for monomerid = 50158274
Trg + Lig
Ki
nM
ΔG°
kcal/mole
IC50
nM
Kd
nM
EC50/IC50
nM
koff
s-1
kon
M-1s-1
pHTemp
°C
Glycogen Phosphorylase (PYGL)
(Homo sapiens (Human))
BDBM50158274
(5-Chloro-1H-indole-2-carboxylic acid {[cyclohexyl-...)
Show SMILES OCCN(C1CCCCC1)C(=O)CNC(=O)c1cc2cc(Cl)ccc2[nH]1
Show InChI InChI=1S/C19H24ClN3O3/c20-14-6-7-16-13(10-14)11-17(22-16)19(26)21-12-18(25)23(8-9-24)15-4-2-1-3-5-15/h6-7,10-11,15,22,24H,1-5,8-9,12H2,(H,21,26)
Reactome pathway
n/an/a 99n/an/an/an/an/an/a
Pfizer Global Research and Development
Curated by ChEMBL
Assay Description
Inhibitory concentration against glycogen phosphorylase
Bioorg Med Chem Lett 15: 459-65 (2004)
Article DOI: 10.1016/j.bmcl.2004.10.048
BindingDB Entry DOI: 10.7270/Q26W99K6