BDBM50158380 3-(4-amino-2-methyl-phenylazo)-naphthalene-1,5-disulfonic acid::CHEMBL222994
SMILES: Cc1cc(N)ccc1\N=N\c1cc(c2cccc(c2c1)S(O)(=O)=O)S(O)(=O)=O
InChI Key: InChIKey=XXZDPVOWJBCNQC-FMQUCBEESA-N
Data: 1 IC50
Activity Spreadsheet -- Enzyme Inhibition Constant Data from BindingDB
Found 1 hit for monomerid = 50158380
Trg + Lig
Ki
nM
ΔG°
kcal/mole
IC50
nM
Kd
nM
EC50/IC50
nM
koff
s-1
kon
M-1s-1
pHTemp
°C
AICAR transformylase
(Homo sapiens (Human))
BDBM50158380
(3-(4-amino-2-methyl-phenylazo)-naphthalene-1,5-dis...)
Show SMILES Cc1cc(N)ccc1\N=N\c1cc(c2cccc(c2c1)S(O)(=O)=O)S(O)(=O)=O
Show InChI InChI=1S/C17H15N3O6S2/c1-10-7-11(18)5-6-15(10)20-19-12-8-14-13(17(9-12)28(24,25)26)3-2-4-16(14)27(21,22)23/h2-9H,18H2,1H3,(H,21,22,23)(H,24,25,26)/b20-19+
Reactome pathway
n/an/a 7.60E+3n/an/an/an/an/an/a
The Scripps Research Institute
Curated by ChEMBL
Assay Description
Inhibition of human AICAR Tfase
J Med Chem 47: 6681-90 (2004)
Article DOI: 10.1021/jm049504o
BindingDB Entry DOI: 10.7270/Q2PZ589Q