BDBM50158388 4-(1-aminonaphthalene-6-sulfonamido)benzoic acid::CHEMBL221733
SMILES: Nc1cccc2cc(ccc12)S(=O)(=O)Nc1ccc(cc1)C(O)=O
InChI Key: InChIKey=BAYMNCHSODLCJV-UHFFFAOYSA-N
Data: 1 IC50
Activity Spreadsheet -- Enzyme Inhibition Constant Data from BindingDB
Found 1 hit for monomerid = 50158388
Trg + Lig
Ki
nM
ΔG°
kcal/mole
IC50
nM
Kd
nM
EC50/IC50
nM
koff
s-1
kon
M-1s-1
pHTemp
°C
AICAR transformylase
(Homo sapiens (Human))
BDBM50158388
(4-(1-aminonaphthalene-6-sulfonamido)benzoic acid |...)
Show SMILES Nc1cccc2cc(ccc12)S(=O)(=O)Nc1ccc(cc1)C(O)=O
Show InChI InChI=1S/C17H14N2O4S/c18-16-3-1-2-12-10-14(8-9-15(12)16)24(22,23)19-13-6-4-11(5-7-13)17(20)21/h1-10,19H,18H2,(H,20,21)
Reactome pathway
n/an/a 4.10E+3n/an/an/an/an/an/a
The Scripps Research Institute
Curated by ChEMBL
Assay Description
Inhibition of human AICAR Tfase
J Med Chem 47: 6681-90 (2004)
Article DOI: 10.1021/jm049504o
BindingDB Entry DOI: 10.7270/Q2PZ589Q