null
SMILES: Cc1nnc(C[C@@H]2C=C(c3ccc(Cl)cc3)c3ccccc3-n3c(C)nnc23)o1
InChI Key: InChIKey=AGYIAWHWIUZNSD-INIZCTEOSA-N
Activity Spreadsheet -- Enzyme Inhibition Constant Data from BindingDB
Found 1 hit for monomerid = 50158586
Trg + Lig
Ki
nM
ΔG°
kcal/mole
IC50
nM
Kd
nM
EC50/IC50
nM
koff
s-1
kon
M-1s-1
pHTemp
°C
Bromodomain-containing protein 4
(Homo sapiens (Human))
BDBM50158586
(CHEMBL3785668)
Show SMILES Cc1nnc(C[C@@H]2C=C(c3ccc(Cl)cc3)c3ccccc3-n3c(C)nnc23)o1 |r,t:7|
Show InChI InChI=1S/C22H18ClN5O/c1-13-24-27-22-16(12-21-26-25-14(2)29-21)11-19(15-7-9-17(23)10-8-15)18-5-3-4-6-20(18)28(13)22/h3-11,16H,12H2,1-2H3/t16-/m0/s1
n/an/a 20n/an/an/an/an/an/a
Genentech
Curated by ChEMBL
Assay Description
Displacement of biotinylated tetra-acetylated histone H4 from his-tagged BRD4 bromodomain1 (unknown origin) incubated for 1 hr at 22 degC followed by...
J Med Chem 59: 1271-98 (2016)
BindingDB Entry DOI: 10.7270/Q2X92D6H