BDBM50158693 CHEMBL3787133::US10273222, Example 1
SMILES: Cn1cnc(c1)-c1cc(ccn1)C(O)=O
InChI Key: InChIKey=CZNFQLDDPKKPMX-UHFFFAOYSA-N
Data: 12 IC50
Activity Spreadsheet -- Enzyme Inhibition Constant Data from BindingDB
Found 12 hits for monomerid = 50158693
Trg + Lig
Ki
nM
ΔG°
kcal/mole
IC50
nM
Kd
nM
EC50/IC50
nM
koff
s-1
kon
M-1s-1
pHTemp
°C
Lysine-specific demethylase 4C
(Homo sapiens (Human))
BDBM50158693
(CHEMBL3787133 | US10273222, Example 1)
Show SMILES Cn1cnc(c1)-c1cc(ccn1)C(O)=O
Show InChI InChI=1S/C10H9N3O2/c1-13-5-9(12-6-13)8-4-7(10(14)15)2-3-11-8/h2-6H,1H3,(H,14,15)
n/an/a<100n/an/an/an/an/an/a
University of Oxford
Curated by ChEMBL
Assay Description
Inhibition of recombinant human N-terminal GST-tagged KDM4C (2 to 372 residues) expressed in baculovirus infected sf9 cells using biotin-H3K9me3 subs...
J Med Chem 59: 1308-29 (2016)
BindingDB Entry DOI: 10.7270/Q2MP5559
Lysine-specific demethylase 4A
(Homo sapiens (Human))
BDBM50158693
(CHEMBL3787133 | US10273222, Example 1)
Show SMILES Cn1cnc(c1)-c1cc(ccn1)C(O)=O
Show InChI InChI=1S/C10H9N3O2/c1-13-5-9(12-6-13)8-4-7(10(14)15)2-3-11-8/h2-6H,1H3,(H,14,15)
n/an/a<100n/an/an/an/an/an/a
University of Oxford
Curated by ChEMBL
Assay Description
Inhibition of recombinant human N-terminal His-tagged KDM4A (1 to 350 residues) expressed in Escherichia coli using biotin-H3K9me3 substrate incubate...
J Med Chem 59: 1308-29 (2016)
BindingDB Entry DOI: 10.7270/Q2MP5559
Lysine-specific demethylase 2B
(Homo sapiens (Human))
BDBM50158693
(CHEMBL3787133 | US10273222, Example 1)
Show SMILES Cn1cnc(c1)-c1cc(ccn1)C(O)=O
Show InChI InChI=1S/C10H9N3O2/c1-13-5-9(12-6-13)8-4-7(10(14)15)2-3-11-8/h2-6H,1H3,(H,14,15)
n/an/a<100n/an/an/an/an/an/a
University of Oxford
Curated by ChEMBL
Assay Description
Inhibition of recombinant human C-terminal FLAG-tagged KDM2B (1 to 650 residues) expressed in baculovirus infected sf9 cells using biotin-H3K36me2 su...
J Med Chem 59: 1308-29 (2016)
BindingDB Entry DOI: 10.7270/Q2MP5559
Lysine-specific demethylase 5A
(Homo sapiens (Human))
BDBM50158693
(CHEMBL3787133 | US10273222, Example 1)
Show SMILES Cn1cnc(c1)-c1cc(ccn1)C(O)=O
Show InChI InChI=1S/C10H9N3O2/c1-13-5-9(12-6-13)8-4-7(10(14)15)2-3-11-8/h2-6H,1H3,(H,14,15)
Reactome pathway
n/an/a>1.00E+4n/an/an/an/an/an/a
University of Oxford
Curated by ChEMBL
Assay Description
Inhibition of KDM5A in human ZR-75-1 cells assessed as reduction in H3K4me3 demethylation incubated for 72 hrs by fluorometric immunoassay
J Med Chem 59: 1308-29 (2016)
BindingDB Entry DOI: 10.7270/Q2MP5559
Lysine-specific demethylase 5B
(Homo sapiens (Human))
BDBM50158693
(CHEMBL3787133 | US10273222, Example 1)
Show SMILES Cn1cnc(c1)-c1cc(ccn1)C(O)=O
Show InChI InChI=1S/C10H9N3O2/c1-13-5-9(12-6-13)8-4-7(10(14)15)2-3-11-8/h2-6H,1H3,(H,14,15)
n/an/a>1.00E+4n/an/an/an/an/an/a
University of Oxford
Curated by ChEMBL
Assay Description
Inhibition of KDM5B in human ZR-75-1 cells assessed as reduction in H3K4me3 demethylation incubated for 72 hrs by fluorometric immunoassay
J Med Chem 59: 1308-29 (2016)
BindingDB Entry DOI: 10.7270/Q2MP5559
Homo sapiens lysine demethylase 2B (KDM2B)
(Homo sapiens (Human))
BDBM50158693
(CHEMBL3787133 | US10273222, Example 1)
Show SMILES Cn1cnc(c1)-c1cc(ccn1)C(O)=O
Show InChI InChI=1S/C10H9N3O2/c1-13-5-9(12-6-13)8-4-7(10(14)15)2-3-11-8/h2-6H,1H3,(H,14,15)
US Patent
n/an/a<100n/an/an/an/an/an/a
Novartis
Assay Description
The ability of test compounds to inhibit the activity of FBXL10 was determined in 384-well plate format under the following reaction conditions: 0.3 ...
J Med Chem 51: 5502-5 (2008)
BindingDB Entry DOI: 10.7270/Q2DF6THR
Lysine-specific demethylase 5B
(Homo sapiens (Human))
BDBM50158693
(CHEMBL3787133 | US10273222, Example 1)
Show SMILES Cn1cnc(c1)-c1cc(ccn1)C(O)=O
Show InChI InChI=1S/C10H9N3O2/c1-13-5-9(12-6-13)8-4-7(10(14)15)2-3-11-8/h2-6H,1H3,(H,14,15)
n/an/a<100n/an/an/an/an/an/a
University of Oxford
Curated by ChEMBL
Assay Description
Inhibition of recombinant human N-terminal His-FLAG-tagged KDM5B (2 to 751 residues) expressed in baculovirus infected sf9 cells using biotin-H3K4me3...
J Med Chem 59: 1308-29 (2016)
BindingDB Entry DOI: 10.7270/Q2MP5559
Lysine-specific demethylase 5A
(Homo sapiens (Human))
BDBM50158693
(CHEMBL3787133 | US10273222, Example 1)
Show SMILES Cn1cnc(c1)-c1cc(ccn1)C(O)=O
Show InChI InChI=1S/C10H9N3O2/c1-13-5-9(12-6-13)8-4-7(10(14)15)2-3-11-8/h2-6H,1H3,(H,14,15)
Reactome pathway
US Patent
n/an/a<100n/an/an/an/an/an/a
Novartis
Assay Description
The enzymatic assay of Jarid1A activity is based upon Time Resolved-Fluorescence Resonance Energy Transfer (TR-FRET) detection. The ability of test c...
J Med Chem 51: 5502-5 (2008)
BindingDB Entry DOI: 10.7270/Q2DF6THR
Lysine-specific demethylase 5B
(Homo sapiens (Human))
BDBM50158693
(CHEMBL3787133 | US10273222, Example 1)
Show SMILES Cn1cnc(c1)-c1cc(ccn1)C(O)=O
Show InChI InChI=1S/C10H9N3O2/c1-13-5-9(12-6-13)8-4-7(10(14)15)2-3-11-8/h2-6H,1H3,(H,14,15)
US Patent
n/an/a<100n/an/an/an/an/an/a
Novartis
Assay Description
The ability of test compounds to inhibit the activity of Jarid1B was determined in 384-well plate format under the following reaction conditions: 0.8...
J Med Chem 51: 5502-5 (2008)
BindingDB Entry DOI: 10.7270/Q2DF6THR
Lysine-specific demethylase 4C
(Homo sapiens (Human))
BDBM50158693
(CHEMBL3787133 | US10273222, Example 1)
Show SMILES Cn1cnc(c1)-c1cc(ccn1)C(O)=O
Show InChI InChI=1S/C10H9N3O2/c1-13-5-9(12-6-13)8-4-7(10(14)15)2-3-11-8/h2-6H,1H3,(H,14,15)
US Patent
n/an/a<100n/an/an/an/an/an/a
Novartis
Assay Description
The ability of test compounds to inhibit the activity of JMJD2C was determined in 384-well plate format under the following reaction conditions: 0.3 ...
J Med Chem 51: 5502-5 (2008)
BindingDB Entry DOI: 10.7270/Q2DF6THR
Lysine-specific demethylase 4A
(Homo sapiens (Human))
BDBM50158693
(CHEMBL3787133 | US10273222, Example 1)
Show SMILES Cn1cnc(c1)-c1cc(ccn1)C(O)=O
Show InChI InChI=1S/C10H9N3O2/c1-13-5-9(12-6-13)8-4-7(10(14)15)2-3-11-8/h2-6H,1H3,(H,14,15)
US Patent
n/an/a<100n/an/an/an/an/an/a
Novartis
Assay Description
The ability of test compounds to inhibit the activity of JMJD2A was determined in 384-well plate format under the following reaction conditions: 2 nM...
J Med Chem 51: 5502-5 (2008)
BindingDB Entry DOI: 10.7270/Q2DF6THR
Lysine-specific demethylase 5A
(Homo sapiens (Human))
BDBM50158693
(CHEMBL3787133 | US10273222, Example 1)
Show SMILES Cn1cnc(c1)-c1cc(ccn1)C(O)=O
Show InChI InChI=1S/C10H9N3O2/c1-13-5-9(12-6-13)8-4-7(10(14)15)2-3-11-8/h2-6H,1H3,(H,14,15)
Reactome pathway
n/an/a<100n/an/an/an/an/an/a
University of Oxford
Curated by ChEMBL
Assay Description
Inhibition of recombinant human C-terminal FLAG-tagged KDM5A (1 to 1090 residues) expressed in baculovirus infected sf9 cells using biotin-H3K4me3 su...
J Med Chem 59: 1308-29 (2016)
BindingDB Entry DOI: 10.7270/Q2MP5559