BDBM50158744 CHEMBL435309::N-Naphthalen-2-yl-3-{4-oxo-5-[1-thiophen-2-yl-meth-(Z)-ylidene]-2-thioxo-thiazolidin-3-yl}-propionamide
SMILES: O=C(CCN1C(=S)S\C(=C/c2cccs2)C1=O)Nc1ccc2ccccc2c1
InChI Key: InChIKey=RQWGEUKYRLAQPC-AQTBWJFISA-N
Data: 2 IC50
Activity Spreadsheet -- Enzyme Inhibition Constant Data from BindingDB
Found 2 hits for monomerid = 50158744
Trg + Lig
Ki
nM
ΔG°
kcal/mole
IC50
nM
Kd
nM
EC50/IC50
nM
koff
s-1
kon
M-1s-1
pHTemp
°C
Human immunodeficiency virus type 1 reverse transcriptase
(Human immunodeficiency virus 1)
BDBM50158744
(CHEMBL435309 | N-Naphthalen-2-yl-3-{4-oxo-5-[1-thi...)
Show SMILES O=C(CCN1C(=S)S\C(=C/c2cccs2)C1=O)Nc1ccc2ccccc2c1
Show InChI InChI=1S/C21H16N2O2S3/c24-19(22-16-8-7-14-4-1-2-5-15(14)12-16)9-10-23-20(25)18(28-21(23)26)13-17-6-3-11-27-17/h1-8,11-13H,9-10H2,(H,22,24)/b18-13-
n/an/a>1.00E+5n/an/an/an/an/an/a
University of Southern California
Curated by ChEMBL
Assay Description
Inhibitory concentration against human immuno deficiency virus type 1 integrase (3'-processing)
J Med Chem 48: 111-20 (2005)
Article DOI: 10.1021/jm0496077
BindingDB Entry DOI: 10.7270/Q28S4PD6
Human immunodeficiency virus type 1 reverse transcriptase
(Human immunodeficiency virus 1)
BDBM50158744
(CHEMBL435309 | N-Naphthalen-2-yl-3-{4-oxo-5-[1-thi...)
Show SMILES O=C(CCN1C(=S)S\C(=C/c2cccs2)C1=O)Nc1ccc2ccccc2c1
Show InChI InChI=1S/C21H16N2O2S3/c24-19(22-16-8-7-14-4-1-2-5-15(14)12-16)9-10-23-20(25)18(28-21(23)26)13-17-6-3-11-27-17/h1-8,11-13H,9-10H2,(H,22,24)/b18-13-
n/an/a>1.00E+5n/an/an/an/an/an/a
University of Southern California
Curated by ChEMBL
Assay Description
Inhibitory concentration against human immuno deficiency virus type 1 integrase (Strand Transfer)
J Med Chem 48: 111-20 (2005)
Article DOI: 10.1021/jm0496077
BindingDB Entry DOI: 10.7270/Q28S4PD6