BDBM50158837 4-(3'',5''-Dichloro-2''-cyano-biphenyl-3-yl)-2,4-dioxo-butyric acid::CHEMBL178973
SMILES: OC(=O)C(=O)CC(=O)c1cccc(c1)-c1cc(Cl)cc(Cl)c1C#N
InChI Key: InChIKey=WKWGOYUOKKHVBD-UHFFFAOYSA-N
Data: 1 IC50
Activity Spreadsheet -- Enzyme Inhibition Constant Data from BindingDB
Found 1 hit for monomerid = 50158837
Trg + Lig
Ki
nM
ΔG°
kcal/mole
IC50
nM
Kd
nM
EC50/IC50
nM
koff
s-1
kon
M-1s-1
pHTemp
°C
Genome polyprotein
(Hepatitis C virus (HCV))
BDBM50158837
(4-(3'',5''-Dichloro-2''-cyano-biphenyl-3-yl)-2,4-d...)
Show SMILES OC(=O)C(=O)CC(=O)c1cccc(c1)-c1cc(Cl)cc(Cl)c1C#N
Show InChI InChI=1S/C17H9Cl2NO4/c18-11-5-12(13(8-20)14(19)6-11)9-2-1-3-10(4-9)15(21)7-16(22)17(23)24/h1-6H,7H2,(H,23,24)
n/an/a 45n/an/an/an/an/an/a
University of Wollongong
Curated by ChEMBL
Assay Description
Inhibitory concentration against hepatitis C virus polymerase
J Med Chem 48: 1-20 (2005)
Article DOI: 10.1021/jm0400101
BindingDB Entry DOI: 10.7270/Q2XP75Q1