BDBM50158897 CHEMBL3786105
SMILES: FC(F)(F)c1ccc(C2CCOc3cc(ccc23)S(=O)(=O)Nc2nccs2)c(c1)C1=CCNCC1
InChI Key: InChIKey=GUGZIAOSXOELAU-UHFFFAOYSA-N
Data: 1 IC50
Activity Spreadsheet -- Enzyme Inhibition Constant Data from BindingDB
Found 1 hit for monomerid = 50158897
Trg + Lig
Ki
nM
ΔG°
kcal/mole
IC50
nM
Kd
nM
EC50/IC50
nM
koff
s-1
kon
M-1s-1
pHTemp
°C
Sodium channel protein type 9 subunit alpha
(Homo sapiens (Human))
BDBM50158897
(CHEMBL3786105)
Show SMILES FC(F)(F)c1ccc(C2CCOc3cc(ccc23)S(=O)(=O)Nc2nccs2)c(c1)C1=CCNCC1 |t:33|
Show InChI InChI=1S/C24H22F3N3O3S2/c25-24(26,27)16-1-3-18(21(13-16)15-5-8-28-9-6-15)19-7-11-33-22-14-17(2-4-20(19)22)35(31,32)30-23-29-10-12-34-23/h1-5,10,12-14,19,28H,6-9,11H2,(H,29,30)
n/an/a 1n/an/an/an/an/an/a
Temple University
Curated by ChEMBL
Assay Description
Inhibition of Nav1.7 (unknown origin) overexpressed in HEK293 cells preincubated for 15 to 20 mins followed by depolarization with 10 to 30 uM veratr...
ACS Med Chem Lett 6: 1168-70 (2015)
BindingDB Entry DOI: 10.7270/Q2H133WN