BDBM50159039 Ac-I[CVWQDWGdAHRC]T::CHEMBL409250
SMILES: CC[C@H](C)[C@H](NC(C)=O)C(=O)N[C@H]1CSSC[C@H](NC(=O)[C@H](CCCNC(N)=N)NC(=O)[C@@H](Cc2cnc[nH]2)NC(=O)[C@@H](C)NC(=O)CNC(=O)[C@H](Cc2c[nH]c3ccccc23)NC(=O)[C@@H](CC(O)=O)NC(=O)[C@H](CCC(N)=O)NC(=O)[C@@H](Cc2c[nH]c3ccccc23)NC(=O)[C@@H](NC1=O)C(C)C)C(=O)N[C@H]([C@@H](C)O)C(O)=O
InChI Key: InChIKey=XVHYFABBPDIZAN-NRTRWDTKSA-N
Data: 1 IC50
Activity Spreadsheet -- Enzyme Inhibition Constant Data from BindingDB
Found 1 hit for monomerid = 50159039
Trg + Lig
Ki
nM
ΔG°
kcal/mole
IC50
nM
Kd
nM
EC50/IC50
nM
koff
s-1
kon
M-1s-1
pHTemp
°C
Complement C3
(Homo sapiens (Human))
BDBM50159039
(Ac-I[CVWQDWGdAHRC]T | CHEMBL409250)
Show SMILES CC[C@H](C)[C@H](NC(C)=O)C(=O)N[C@H]1CSSC[C@H](NC(=O)[C@H](CCCNC(N)=N)NC(=O)[C@@H](Cc2cnc[nH]2)NC(=O)[C@@H](C)NC(=O)CNC(=O)[C@H](Cc2c[nH]c3ccccc23)NC(=O)[C@@H](CC(O)=O)NC(=O)[C@H](CCC(N)=O)NC(=O)[C@@H](Cc2c[nH]c3ccccc23)NC(=O)[C@@H](NC1=O)C(C)C)C(=O)N[C@H]([C@@H](C)O)C(O)=O
Show InChI InChI=1S/C71H99N21O19S2/c1-8-34(4)57(82-37(7)94)69(109)90-52-31-113-112-30-51(67(107)92-58(36(6)93)70(110)111)89-61(101)45(18-13-21-76-71(73)74)83-64(104)49(24-40-28-75-32-80-40)85-59(99)35(5)81-54(96)29-79-60(100)47(22-38-26-77-43-16-11-9-14-41(38)43)86-65(105)50(25-55(97)98)87-62(102)46(19-20-53(72)95)84-63(103)48(88-68(108)56(33(2)3)91-66(52)106)23-39-27-78-44-17-12-10-15-42(39)44/h9-12,14-17,26-28,32-36,45-52,56-58,77-78,93H,8,13,18-25,29-31H2,1-7H3,(H2,72,95)(H,75,80)(H,79,100)(H,81,96)(H,82,94)(H,83,104)(H,84,103)(H,85,99)(H,86,105)(H,87,102)(H,88,108)(H,89,101)(H,90,109)(H,91,106)(H,92,107)(H,97,98)(H,110,111)(H4,73,74,76)/t34-,35+,36+,45-,46-,47-,48+,49+,50+,51-,52-,56-,57-,58+/m0/s1
n/an/a 1.32E+5n/an/an/an/an/an/a
University of California at Riverside
Curated by ChEMBL
Assay Description
Inhibitory concentration for human complement component C3 activation
J Med Chem 48: 274-86 (2005)
Article DOI: 10.1021/jm0495531
BindingDB Entry DOI: 10.7270/Q2DR2W81