BDBM50159536 CHEMBL3786916
SMILES: CC(C)S(=O)(=O)c1sc(C)nc1Nc1nc(Nc2cc(C)c(cc2OC2CC2)C2CCN(C)CC2)ncc1Cl
InChI Key: InChIKey=UJLWFRSYBKZXKS-UHFFFAOYSA-N
Data: 2 IC50
Activity Spreadsheet -- Enzyme Inhibition Constant Data from BindingDB
Found 2 hits for monomerid = 50159536
Trg + Lig
Ki
nM
ΔG°
kcal/mole
IC50
nM
Kd
nM
EC50/IC50
nM
koff
s-1
kon
M-1s-1
pHTemp
°C
ALK tyrosine kinase receptor
(Homo sapiens (Human))
BDBM50159536
(CHEMBL3786916)
Show SMILES CC(C)S(=O)(=O)c1sc(C)nc1Nc1nc(Nc2cc(C)c(cc2OC2CC2)C2CCN(C)CC2)ncc1Cl
Show InChI InChI=1S/C27H35ClN6O3S2/c1-15(2)39(35,36)26-25(30-17(4)38-26)32-24-21(28)14-29-27(33-24)31-22-12-16(3)20(13-23(22)37-19-6-7-19)18-8-10-34(5)11-9-18/h12-15,18-19H,6-11H2,1-5H3,(H2,29,31,32,33)
n/an/a 19n/an/an/an/an/an/a
Beijing Pearl Biotech Ltd
Curated by ChEMBL
Assay Description
Inhibition of recombinant human ALK L1196M mutant using tyrosine kinase substrate-biotin after 30 mins by HTRF assay
Bioorg Med Chem Lett 26: 1910-8 (2016)
BindingDB Entry DOI: 10.7270/Q26M38QJ
ALK tyrosine kinase receptor
(Homo sapiens (Human))
BDBM50159536
(CHEMBL3786916)
Show SMILES CC(C)S(=O)(=O)c1sc(C)nc1Nc1nc(Nc2cc(C)c(cc2OC2CC2)C2CCN(C)CC2)ncc1Cl
Show InChI InChI=1S/C27H35ClN6O3S2/c1-15(2)39(35,36)26-25(30-17(4)38-26)32-24-21(28)14-29-27(33-24)31-22-12-16(3)20(13-23(22)37-19-6-7-19)18-8-10-34(5)11-9-18/h12-15,18-19H,6-11H2,1-5H3,(H2,29,31,32,33)
n/an/a 3n/an/an/an/an/an/a
Beijing Pearl Biotech Ltd
Curated by ChEMBL
Assay Description
Inhibition of recombinant human wild type ALK using tyrosine kinase substrate-biotin after 30 mins by HTRF assay
Bioorg Med Chem Lett 26: 1910-8 (2016)
BindingDB Entry DOI: 10.7270/Q26M38QJ