BDBM50159655 2-(3-Chloro-phenyl)-benzo[h]chromen-4-one::CHEMBL368236
SMILES: Clc1cccc(c1)-c1cc(=O)c2ccc3ccccc3c2o1
InChI Key: InChIKey=GTBLQVSIEGDPPV-UHFFFAOYSA-N
Data: 5 IC50
Activity Spreadsheet -- Enzyme Inhibition Constant Data from BindingDB
Found 5 hits for monomerid = 50159655
Trg + Lig
Ki
nM
ΔG°
kcal/mole
IC50
nM
Kd
nM
EC50/IC50
nM
koff
s-1
kon
M-1s-1
pHTemp
°C
DNA-dependent protein kinase catalytic subunit
(Homo sapiens (Human))
BDBM50159655
(2-(3-Chloro-phenyl)-benzo[h]chromen-4-one | CHEMBL...)
Show SMILES Clc1cccc(c1)-c1cc(=O)c2ccc3ccccc3c2o1
Show InChI InChI=1S/C19H11ClO2/c20-14-6-3-5-13(10-14)18-11-17(21)16-9-8-12-4-1-2-7-15(12)19(16)22-18/h1-11H
n/an/a>1.00E+4n/an/an/an/an/an/a
The University
Curated by ChEMBL
Assay Description
Inhibition of DNA dependent protein kinase isolated from HeLa cells
J Med Chem 48: 569-85 (2005)
Article DOI: 10.1021/jm049526a
BindingDB Entry DOI: 10.7270/Q2BK1BV9
Carboxylic ester hydrolase
(Sus scrofa)
BDBM50159655
(2-(3-Chloro-phenyl)-benzo[h]chromen-4-one | CHEMBL...)
Show SMILES Clc1cccc(c1)-c1cc(=O)c2ccc3ccccc3c2o1
Show InChI InChI=1S/C19H11ClO2/c20-14-6-3-5-13(10-14)18-11-17(21)16-9-8-12-4-1-2-7-15(12)19(16)22-18/h1-11H
n/an/a 7n/an/an/an/an/an/a
Guru Nanak Dev University
Curated by ChEMBL
Assay Description
Inhibition of porcine cholesterol esterase using para-nitrophenyl butyrate as substrate after 5 mins in presence of sodium taurocholate by spectropho...
Bioorg Med Chem Lett 27: 850-854 (2017)
Article DOI: 10.1016/j.bmcl.2017.01.020
BindingDB Entry DOI: 10.7270/Q2PC34PC
Cytochrome P450 1A2
(Homo sapiens (Human))
BDBM50159655
(2-(3-Chloro-phenyl)-benzo[h]chromen-4-one | CHEMBL...)
Show SMILES Clc1cccc(c1)-c1cc(=O)c2ccc3ccccc3c2o1
Show InChI InChI=1S/C19H11ClO2/c20-14-6-3-5-13(10-14)18-11-17(21)16-9-8-12-4-1-2-7-15(12)19(16)22-18/h1-11H
n/an/a 74n/an/an/an/an/an/a
Shanghai Jiao Tong University
Curated by ChEMBL
Assay Description
Inhibition of human recombinant CYP1A2 using 7-ethoxyresorufin as substrate in presence of glucose-6-phosphate, glucose-6-phosphate dehydrogenase and...
Eur J Med Chem 187: (2020)
Article DOI: 10.1016/j.ejmech.2019.111938
Cytochrome P450 1A
(Homo sapiens (Human))
BDBM50159655
(2-(3-Chloro-phenyl)-benzo[h]chromen-4-one | CHEMBL...)
Show SMILES Clc1cccc(c1)-c1cc(=O)c2ccc3ccccc3c2o1
Show InChI InChI=1S/C19H11ClO2/c20-14-6-3-5-13(10-14)18-11-17(21)16-9-8-12-4-1-2-7-15(12)19(16)22-18/h1-11H
Reactome pathway
n/an/a 5.20n/an/an/an/an/an/a
Shanghai Jiao Tong University
Curated by ChEMBL
Assay Description
Inhibition of human recombinant CYP1A1 using 7-ethoxyresorufin as substrate in presence of glucose-6-phosphate, glucose-6-phosphate dehydrogenase and...
Eur J Med Chem 187: (2020)
Article DOI: 10.1016/j.ejmech.2019.111938
Cytochrome P450 1B1
(Homo sapiens (Human))
BDBM50159655
(2-(3-Chloro-phenyl)-benzo[h]chromen-4-one | CHEMBL...)
Show SMILES Clc1cccc(c1)-c1cc(=O)c2ccc3ccccc3c2o1
Show InChI InChI=1S/C19H11ClO2/c20-14-6-3-5-13(10-14)18-11-17(21)16-9-8-12-4-1-2-7-15(12)19(16)22-18/h1-11H
Reactome pathway
n/an/a 0.490n/an/an/an/an/an/a
Shanghai Jiao Tong University
Curated by ChEMBL
Assay Description
Inhibition of human recombinant CYP1B1 using 7-ethoxyresorufin as substrate in presence of glucose-6-phosphate, glucose-6-phosphate dehydrogenase and...
Eur J Med Chem 187: (2020)
Article DOI: 10.1016/j.ejmech.2019.111938