BDBM50160110 5-(4-Chloro-phenyl)-6-(2,4-dichloro-phenyl)-N-piperidin-1-yl-nicotinamide::CHEMBL182241
SMILES: Clc1ccc(cc1)-c1cc(cnc1-c1ccc(Cl)cc1Cl)C(=O)NN1CCCCC1
InChI Key: InChIKey=OVRQUZLLFSEDLA-UHFFFAOYSA-N
Data: 1 IC50
Activity Spreadsheet -- Enzyme Inhibition Constant Data from BindingDB
Found 1 hit for monomerid = 50160110
Trg + Lig
Ki
nM
ΔG°
kcal/mole
IC50
nM
Kd
nM
EC50/IC50
nM
koff
s-1
kon
M-1s-1
pHTemp
°C
Cannabinoid receptor 1
(Homo sapiens (Human))
BDBM50160110
(5-(4-Chloro-phenyl)-6-(2,4-dichloro-phenyl)-N-pipe...)
Show SMILES Clc1ccc(cc1)-c1cc(cnc1-c1ccc(Cl)cc1Cl)C(=O)NN1CCCCC1
Show InChI InChI=1S/C23H20Cl3N3O/c24-17-6-4-15(5-7-17)20-12-16(23(30)28-29-10-2-1-3-11-29)14-27-22(20)19-9-8-18(25)13-21(19)26/h4-9,12-14H,1-3,10-11H2,(H,28,30)
NCI pathway
Reactome pathway
n/an/a 480n/an/an/an/an/an/a
Merck Research Laboratories
Curated by ChEMBL
Assay Description
Inhibitory concentration tested against human Cannabinoid receptor 1 (hCB1)
Bioorg Med Chem Lett 15: 645-51 (2005)
Article DOI: 10.1016/j.bmcl.2004.11.031
BindingDB Entry DOI: 10.7270/Q2X929SW