BDBM50160141 5-(4-Chloro-phenyl)-N-cyclohexyl-6-(2,4-dichloro-phenyl)-nicotinamide::CHEMBL362650
SMILES: Clc1ccc(cc1)-c1cc(cnc1-c1ccc(Cl)cc1Cl)C(=O)NC1CCCCC1
InChI Key: InChIKey=HWWUYYDPBSOWDC-UHFFFAOYSA-N
Data: 1 IC50
Activity Spreadsheet -- Enzyme Inhibition Constant Data from BindingDB
Found 1 hit for monomerid = 50160141
Trg + Lig
Ki
nM
ΔG°
kcal/mole
IC50
nM
Kd
nM
EC50/IC50
nM
koff
s-1
kon
M-1s-1
pHTemp
°C
Cannabinoid receptor 1
(Homo sapiens (Human))
BDBM50160141
(5-(4-Chloro-phenyl)-N-cyclohexyl-6-(2,4-dichloro-p...)
Show SMILES Clc1ccc(cc1)-c1cc(cnc1-c1ccc(Cl)cc1Cl)C(=O)NC1CCCCC1
Show InChI InChI=1S/C24H21Cl3N2O/c25-17-8-6-15(7-9-17)21-12-16(24(30)29-19-4-2-1-3-5-19)14-28-23(21)20-11-10-18(26)13-22(20)27/h6-14,19H,1-5H2,(H,29,30)
NCI pathway
Reactome pathway
n/an/a 210n/an/an/an/an/an/a
Merck Research Laboratories
Curated by ChEMBL
Assay Description
Inhibitory concentration tested against human Cannabinoid receptor 1 (hCB1)
Bioorg Med Chem Lett 15: 645-51 (2005)
Article DOI: 10.1016/j.bmcl.2004.11.031
BindingDB Entry DOI: 10.7270/Q2X929SW