BDBM50160813 CHEMBL182614::Methanesulfonic acid 3-{(R)-2-[(R)-2-(3-benzyloxy-phenyl)-2-hydroxy-ethylamino]-propyl}-1H-indol-7-yl ester
SMILES: C[C@H](Cc1c[nH]c2c(OS(C)(=O)=O)cccc12)NC[C@H](O)c1cccc(OCc2ccccc2)c1
InChI Key: InChIKey=NOUCOYNKCVTYDV-CLOONOSVSA-N
Data: 2 EC50
Activity Spreadsheet -- Enzyme Inhibition Constant Data from BindingDB
Found 2 hits for monomerid = 50160813
Trg + Lig
Ki
nM
ΔG°
kcal/mole
IC50
nM
Kd
nM
EC50/IC50
nM
koff
s-1
kon
M-1s-1
pHTemp
°C
Beta-3 adrenergic receptor
(Homo sapiens (Human))
BDBM50160813
(CHEMBL182614 | Methanesulfonic acid 3-{(R)-2-[(R)-...)
Show SMILES C[C@H](Cc1c[nH]c2c(OS(C)(=O)=O)cccc12)NC[C@H](O)c1cccc(OCc2ccccc2)c1
Show InChI InChI=1S/C27H30N2O5S/c1-19(14-22-16-29-27-24(22)12-7-13-26(27)34-35(2,31)32)28-17-25(30)21-10-6-11-23(15-21)33-18-20-8-4-3-5-9-20/h3-13,15-16,19,25,28-30H,14,17-18H2,1-2H3/t19-,25+/m1/s1
Reactome pathway
n/an/an/an/a 15n/an/an/an/a
Dainippon Pharmaceutical Co., Ltd
Curated by ChEMBL
Assay Description
Agonistic activity was assessed by measuring cAMP accumulation in CHO cells expressing human beta-3 adrenergic receptor
Bioorg Med Chem Lett 15: 1061-4 (2005)
Article DOI: 10.1016/j.bmcl.2004.12.033
BindingDB Entry DOI: 10.7270/Q2TD9WVK
Beta-2 adrenergic receptor
(Homo sapiens (Human))
BDBM50160813
(CHEMBL182614 | Methanesulfonic acid 3-{(R)-2-[(R)-...)
Show SMILES C[C@H](Cc1c[nH]c2c(OS(C)(=O)=O)cccc12)NC[C@H](O)c1cccc(OCc2ccccc2)c1
Show InChI InChI=1S/C27H30N2O5S/c1-19(14-22-16-29-27-24(22)12-7-13-26(27)34-35(2,31)32)28-17-25(30)21-10-6-11-23(15-21)33-18-20-8-4-3-5-9-20/h3-13,15-16,19,25,28-30H,14,17-18H2,1-2H3/t19-,25+/m1/s1
Reactome pathway
n/an/an/an/a 46n/an/an/an/a
Dainippon Pharmaceutical Co., Ltd
Curated by ChEMBL
Assay Description
Agonistic activity was assessed by measuring cAMP accumulation in CHO cells expressing human beta-2 adrenergic receptor
Bioorg Med Chem Lett 15: 1061-4 (2005)
Article DOI: 10.1016/j.bmcl.2004.12.033
BindingDB Entry DOI: 10.7270/Q2TD9WVK