BDBM50160820 CHEMBL182708::Methanesulfonic acid (R)-3-{2-[(R)-2-(3-benzoylamino-phenyl)-2-hydroxy-ethylamino]-propyl}-1H-indol-7-yl ester
SMILES: C[C@H](Cc1c[nH]c2c(OS(C)(=O)=O)cccc12)NC[C@H](O)c1cccc(NC(=O)c2ccccc2)c1
InChI Key: InChIKey=WYTFAQBIDABWBM-KOSHJBKYSA-N
Data: 3 EC50
Activity Spreadsheet -- Enzyme Inhibition Constant Data from BindingDB
Found 3 hits for monomerid = 50160820
Trg + Lig
Ki
nM
ΔG°
kcal/mole
IC50
nM
Kd
nM
EC50/IC50
nM
koff
s-1
kon
M-1s-1
pHTemp
°C
Beta-2 adrenergic receptor
(Homo sapiens (Human))
BDBM50160820
(CHEMBL182708 | Methanesulfonic acid (R)-3-{2-[(R)-...)
Show SMILES C[C@H](Cc1c[nH]c2c(OS(C)(=O)=O)cccc12)NC[C@H](O)c1cccc(NC(=O)c2ccccc2)c1
Show InChI InChI=1S/C27H29N3O5S/c1-18(14-21-16-29-26-23(21)12-7-13-25(26)35-36(2,33)34)28-17-24(31)20-10-6-11-22(15-20)30-27(32)19-8-4-3-5-9-19/h3-13,15-16,18,24,28-29,31H,14,17H2,1-2H3,(H,30,32)/t18-,24+/m1/s1
Reactome pathway
n/an/an/an/a 69n/an/an/an/a
Dainippon Pharmaceutical Co., Ltd
Curated by ChEMBL
Assay Description
Agonistic activity was assessed by measuring cAMP accumulation in CHO cells expressing human beta-2 adrenergic receptor
Bioorg Med Chem Lett 15: 1061-4 (2005)
Article DOI: 10.1016/j.bmcl.2004.12.033
BindingDB Entry DOI: 10.7270/Q2TD9WVK
Beta-1 adrenergic receptor
(Homo sapiens (Human))
BDBM50160820
(CHEMBL182708 | Methanesulfonic acid (R)-3-{2-[(R)-...)
Show SMILES C[C@H](Cc1c[nH]c2c(OS(C)(=O)=O)cccc12)NC[C@H](O)c1cccc(NC(=O)c2ccccc2)c1
Show InChI InChI=1S/C27H29N3O5S/c1-18(14-21-16-29-26-23(21)12-7-13-25(26)35-36(2,33)34)28-17-24(31)20-10-6-11-22(15-20)30-27(32)19-8-4-3-5-9-19/h3-13,15-16,18,24,28-29,31H,14,17H2,1-2H3,(H,30,32)/t18-,24+/m1/s1
Reactome pathway
n/an/an/an/a 120n/an/an/an/a
Dainippon Pharmaceutical Co., Ltd
Curated by ChEMBL
Assay Description
Agonistic activity was assessed by measuring cAMP accumulation in CHO cells expressing human beta-1 adrenergic receptor
Bioorg Med Chem Lett 15: 1061-4 (2005)
Article DOI: 10.1016/j.bmcl.2004.12.033
BindingDB Entry DOI: 10.7270/Q2TD9WVK
Beta-3 adrenergic receptor
(Homo sapiens (Human))
BDBM50160820
(CHEMBL182708 | Methanesulfonic acid (R)-3-{2-[(R)-...)
Show SMILES C[C@H](Cc1c[nH]c2c(OS(C)(=O)=O)cccc12)NC[C@H](O)c1cccc(NC(=O)c2ccccc2)c1
Show InChI InChI=1S/C27H29N3O5S/c1-18(14-21-16-29-26-23(21)12-7-13-25(26)35-36(2,33)34)28-17-24(31)20-10-6-11-22(15-20)30-27(32)19-8-4-3-5-9-19/h3-13,15-16,18,24,28-29,31H,14,17H2,1-2H3,(H,30,32)/t18-,24+/m1/s1
Reactome pathway
n/an/an/an/a 160n/an/an/an/a
Dainippon Pharmaceutical Co., Ltd
Curated by ChEMBL
Assay Description
Agonistic activity was assessed by measuring cAMP accumulation in CHO cells expressing human beta-3 adrenergic receptor
Bioorg Med Chem Lett 15: 1061-4 (2005)
Article DOI: 10.1016/j.bmcl.2004.12.033
BindingDB Entry DOI: 10.7270/Q2TD9WVK