BDBM50160869 CHEMBL3786398
SMILES: CC(C)C[C@@H](NC(=O)CC(NC(=O)[C@H]1CCCc2ccccc12)c1cccc(F)c1)B(O)O
InChI Key: InChIKey=GVCLUQUSDQUHGE-OCESARCHSA-N
Data: 1 IC50
Activity Spreadsheet -- Enzyme Inhibition Constant Data from BindingDB
Found 1 hit for monomerid = 50160869
Trg + Lig
Ki
nM
ΔG°
kcal/mole
IC50
nM
Kd
nM
EC50/IC50
nM
koff
s-1
kon
M-1s-1
pHTemp
°C
20S proteasome chymotrypsin-like
(Homo sapiens (Human))
BDBM50160869
(CHEMBL3786398)
Show SMILES CC(C)C[C@@H](NC(=O)CC(NC(=O)[C@H]1CCCc2ccccc12)c1cccc(F)c1)B(O)O |r|
Show InChI InChI=1S/C25H32BFN2O4/c1-16(2)13-23(26(32)33)29-24(30)15-22(18-9-5-10-19(27)14-18)28-25(31)21-12-6-8-17-7-3-4-11-20(17)21/h3-5,7,9-11,14,16,21-23,32-33H,6,8,12-13,15H2,1-2H3,(H,28,31)(H,29,30)/t21-,22?,23+/m0/s1
Reactome pathway
n/an/a 1n/an/an/an/an/an/a
China Pharmaceutical University
Curated by ChEMBL
Assay Description
Inhibition of chymotrypsin like activity of human erythrocyte-derived 20S proteasome preincubated for 10 mins using Suc-LLVY-AMC as substrate after 6...
Bioorg Med Chem Lett 26: 1958-62 (2016)
BindingDB Entry DOI: 10.7270/Q2GT5Q2Q