null
SMILES: Cc1cccc(NC(=O)c2nc(C)ccc2N)n1
InChI Key: InChIKey=AJLMTLAHHZNLEA-UHFFFAOYSA-N
Activity Spreadsheet -- Enzyme Inhibition Constant Data from BindingDB
Found 1 hit for monomerid = 50161029
Trg + Lig
Ki
nM
ΔG°
kcal/mole
IC50
nM
Kd
nM
EC50/IC50
nM
koff
s-1
kon
M-1s-1
pHTemp
°C
Metabotropic glutamate receptor 5
(Homo sapiens (Human))
BDBM50161029
(3-Amino-6-methyl-pyridine-2-carboxylic acid (6-met...)
Show SMILES Cc1cccc(NC(=O)c2nc(C)ccc2N)n1
Show InChI InChI=1S/C13H14N4O/c1-8-4-3-5-11(15-8)17-13(18)12-10(14)7-6-9(2)16-12/h3-7H,14H2,1-2H3,(H,15,17,18)
n/an/a 22n/an/an/an/an/an/a
Merck Research Laboratories
Curated by ChEMBL
Assay Description
Inhibitory concentration against human recombinant metabotropic glutamate receptor 5 (mGlu5) in Ltk cells determined using fluorescence detection met...
Bioorg Med Chem Lett 15: 1197-200 (2005)
Article DOI: 10.1016/j.bmcl.2004.11.078
BindingDB Entry DOI: 10.7270/Q28G8K6P