BDBM50161468 CHEMBL3794127
SMILES: [#6]\[#6](-[#6])=[#6](\c1ccccc1)-c1ccc(\[#6]=[#6]\[#6](=O)-[#7]-[#8])cc1
InChI Key: InChIKey=UBGPYMQSNFSBLU-JLHYYAGUSA-N
Data: 3 IC50
Activity Spreadsheet -- Enzyme Inhibition Constant Data from BindingDB
Found 3 hits for monomerid = 50161468
Trg + Lig
Ki
nM
ΔG°
kcal/mole
IC50
nM
Kd
nM
EC50/IC50
nM
koff
s-1
kon
M-1s-1
pHTemp
°C
Histone deacetylase 2
(Homo sapiens (Human))
BDBM50161468
(CHEMBL3794127)
Show SMILES [#6]\[#6](-[#6])=[#6](\c1ccccc1)-c1ccc(\[#6]=[#6]\[#6](=O)-[#7]-[#8])cc1
Show InChI InChI=1S/C19H19NO2/c1-14(2)19(16-6-4-3-5-7-16)17-11-8-15(9-12-17)10-13-18(21)20-22/h3-13,22H,1-2H3,(H,20,21)/b13-10+
NCI pathway
Reactome pathway
n/an/a 1.18E+4n/an/an/an/an/an/a
University of Milan
Curated by ChEMBL
Assay Description
Inhibition of human recombinant HDAC2 using Fluor de Lys Green as substrate incubated for 30 mins by fluorescence assay
Eur J Med Chem 112: 99-105 (2016)
BindingDB Entry DOI: 10.7270/Q2HM5BB0
Histone deacetylase
(Homo sapiens (Human))
BDBM50161468
(CHEMBL3794127)
Show SMILES [#6]\[#6](-[#6])=[#6](\c1ccccc1)-c1ccc(\[#6]=[#6]\[#6](=O)-[#7]-[#8])cc1
Show InChI InChI=1S/C19H19NO2/c1-14(2)19(16-6-4-3-5-7-16)17-11-8-15(9-12-17)10-13-18(21)20-22/h3-13,22H,1-2H3,(H,20,21)/b13-10+
n/an/a 2.60E+3n/an/an/an/an/an/a
University of Milan
Curated by ChEMBL
Assay Description
Inhibition of HDAC in human HeLa nuclear extract using BOC-Ac-Lys-AMC as substrate incubated for 90 mins by fluorescence assay
Eur J Med Chem 112: 99-105 (2016)
BindingDB Entry DOI: 10.7270/Q2HM5BB0
Histone deacetylase
(Homo sapiens (Human))
BDBM50161468
(CHEMBL3794127)
Show SMILES [#6]\[#6](-[#6])=[#6](\c1ccccc1)-c1ccc(\[#6]=[#6]\[#6](=O)-[#7]-[#8])cc1
Show InChI InChI=1S/C19H19NO2/c1-14(2)19(16-6-4-3-5-7-16)17-11-8-15(9-12-17)10-13-18(21)20-22/h3-13,22H,1-2H3,(H,20,21)/b13-10+
n/an/a 2.50E+3n/an/an/an/an/an/a
University of Milan
Curated by ChEMBL
Assay Description
Inhibition of HDAC in human HeLa cells using BOC-Ac-Lys-AMC as substrate incubated for 4 hrs by fluorescence assay
Eur J Med Chem 112: 99-105 (2016)
BindingDB Entry DOI: 10.7270/Q2HM5BB0