BDBM50161672 3-(5-Bromo-thiazol-2-yl)-1-cyclopentylmethyl-1-(6-methoxy-pyridin-3-yl)-urea::CHEMBL178308
SMILES: COc1ccc(cn1)N(CC1CCCC1)C(=O)Nc1ncc(Br)s1
InChI Key: InChIKey=FPULTEMSSLVQMG-UHFFFAOYSA-N
Data: 1 EC50
Activity Spreadsheet -- Enzyme Inhibition Constant Data from BindingDB
Found 1 hit for monomerid = 50161672
Trg + Lig
Ki
nM
ΔG°
kcal/mole
IC50
nM
Kd
nM
EC50/IC50
nM
koff
s-1
kon
M-1s-1
pHTemp
°C
Hexokinase type IV
(Rattus norvegicus)
BDBM50161672
(3-(5-Bromo-thiazol-2-yl)-1-cyclopentylmethyl-1-(6-...)
Show SMILES COc1ccc(cn1)N(CC1CCCC1)C(=O)Nc1ncc(Br)s1
Show InChI InChI=1S/C16H19BrN4O2S/c1-23-14-7-6-12(8-18-14)21(10-11-4-2-3-5-11)16(22)20-15-19-9-13(17)24-15/h6-9,11H,2-5,10H2,1H3,(H,19,20,22)
Reactome pathway
n/an/an/an/a 2.00E+3n/an/an/an/a
OSI Pharmaceuticals
Curated by ChEMBL
Assay Description
Effective concentration for glucokinase activation with 5 mM glucose
Bioorg Med Chem Lett 15: 1501-4 (2005)
Article DOI: 10.1016/j.bmcl.2004.12.083
BindingDB Entry DOI: 10.7270/Q2HT2NVC