BDBM50161684 1-Cyclopentylmethyl-3-(6-methanesulfonyl-benzothiazol-2-yl)-1-(4-methanesulfonyl-phenyl)-urea::CHEMBL359665
SMILES: CS(=O)(=O)c1ccc(cc1)N(CC1CCCC1)C(=O)Nc1nc2ccc(cc2s1)S(C)(=O)=O
InChI Key: InChIKey=FEZQDAVTVSBLEP-UHFFFAOYSA-N
Data: 1 EC50
Activity Spreadsheet -- Enzyme Inhibition Constant Data from BindingDB
Found 1 hit for monomerid = 50161684
Trg + Lig
Ki
nM
ΔG°
kcal/mole
IC50
nM
Kd
nM
EC50/IC50
nM
koff
s-1
kon
M-1s-1
pHTemp
°C
Hexokinase type IV
(Rattus norvegicus)
BDBM50161684
(1-Cyclopentylmethyl-3-(6-methanesulfonyl-benzothia...)
Show SMILES CS(=O)(=O)c1ccc(cc1)N(CC1CCCC1)C(=O)Nc1nc2ccc(cc2s1)S(C)(=O)=O
Show InChI InChI=1S/C22H25N3O5S3/c1-32(27,28)17-9-7-16(8-10-17)25(14-15-5-3-4-6-15)22(26)24-21-23-19-12-11-18(33(2,29)30)13-20(19)31-21/h7-13,15H,3-6,14H2,1-2H3,(H,23,24,26)
Reactome pathway
n/an/an/an/a 3.29E+4n/an/an/an/a
OSI Pharmaceuticals
Curated by ChEMBL
Assay Description
Effective concentration for glucokinase activation with 5 mM glucose
Bioorg Med Chem Lett 15: 1501-4 (2005)
Article DOI: 10.1016/j.bmcl.2004.12.083
BindingDB Entry DOI: 10.7270/Q2HT2NVC