BDBM50161689 3-(5-Chloro-thiazol-2-yl)-1-(4-methanesulfonyl-phenyl)-1-(tetrahydro-furan-3-ylmethyl)-urea::CHEMBL178604
SMILES: CS(=O)(=O)c1ccc(cc1)N(CC1CCOC1)C(=O)Nc1ncc(Cl)s1
InChI Key: InChIKey=XLDVQYYZLAXYFF-UHFFFAOYSA-N
Data: 1 EC50
Activity Spreadsheet -- Enzyme Inhibition Constant Data from BindingDB
Found 1 hit for monomerid = 50161689
Trg + Lig
Ki
nM
ΔG°
kcal/mole
IC50
nM
Kd
nM
EC50/IC50
nM
koff
s-1
kon
M-1s-1
pHTemp
°C
Hexokinase type IV
(Rattus norvegicus)
BDBM50161689
(3-(5-Chloro-thiazol-2-yl)-1-(4-methanesulfonyl-phe...)
Show SMILES CS(=O)(=O)c1ccc(cc1)N(CC1CCOC1)C(=O)Nc1ncc(Cl)s1
Show InChI InChI=1S/C16H18ClN3O4S2/c1-26(22,23)13-4-2-12(3-5-13)20(9-11-6-7-24-10-11)16(21)19-15-18-8-14(17)25-15/h2-5,8,11H,6-7,9-10H2,1H3,(H,18,19,21)
Reactome pathway
n/an/an/an/a 2.19E+4n/an/an/an/a
OSI Pharmaceuticals
Curated by ChEMBL
Assay Description
Effective concentration for glucokinase activation with 5 mM glucose
Bioorg Med Chem Lett 15: 1501-4 (2005)
Article DOI: 10.1016/j.bmcl.2004.12.083
BindingDB Entry DOI: 10.7270/Q2HT2NVC