BDBM50161691 CHEMBL180172::N-{3-[3-(5-Chloro-thiazol-2-yl)-1-cyclopentylmethyl-ureido]-phenyl}-acetamide
SMILES: CC(=O)Nc1cccc(c1)N(CC1CCCC1)C(=O)Nc1ncc(Cl)s1
InChI Key: InChIKey=KGMSOAMFBQEPEK-UHFFFAOYSA-N
Data: 1 EC50
Activity Spreadsheet -- Enzyme Inhibition Constant Data from BindingDB
Found 1 hit for monomerid = 50161691
Trg + Lig
Ki
nM
ΔG°
kcal/mole
IC50
nM
Kd
nM
EC50/IC50
nM
koff
s-1
kon
M-1s-1
pHTemp
°C
Hexokinase type IV
(Rattus norvegicus)
BDBM50161691
(CHEMBL180172 | N-{3-[3-(5-Chloro-thiazol-2-yl)-1-c...)
Show SMILES CC(=O)Nc1cccc(c1)N(CC1CCCC1)C(=O)Nc1ncc(Cl)s1
Show InChI InChI=1S/C18H21ClN4O2S/c1-12(24)21-14-7-4-8-15(9-14)23(11-13-5-2-3-6-13)18(25)22-17-20-10-16(19)26-17/h4,7-10,13H,2-3,5-6,11H2,1H3,(H,21,24)(H,20,22,25)
Reactome pathway
n/an/an/an/a 300n/an/an/an/a
OSI Pharmaceuticals
Curated by ChEMBL
Assay Description
Effective concentration for glucokinase activation with 5 mM glucose
Bioorg Med Chem Lett 15: 1501-4 (2005)
Article DOI: 10.1016/j.bmcl.2004.12.083
BindingDB Entry DOI: 10.7270/Q2HT2NVC