null
SMILES: Oc1ccc(cc1)-c1sc2cc(O)ccc2c1C(=O)c1ccc(cc1)N1CCN(CC1)C1CCCC1
InChI Key: InChIKey=XNGJGVJVIOZPEE-UHFFFAOYSA-N
Activity Spreadsheet -- Enzyme Inhibition Constant Data from BindingDB
Found 2 hits for monomerid = 50161710
Trg + Lig
Ki
nM
ΔG°
kcal/mole
IC50
nM
Kd
nM
EC50/IC50
nM
koff
s-1
kon
M-1s-1
pHTemp
°C
Estrogen receptor
(Homo sapiens (Human))
BDBM50161710
(CHEMBL366928 | [4-(4-Cyclopentyl-piperazin-1-yl)-p...)
Show SMILES Oc1ccc(cc1)-c1sc2cc(O)ccc2c1C(=O)c1ccc(cc1)N1CCN(CC1)C1CCCC1
Show InChI InChI=1S/C30H30N2O3S/c33-24-11-7-21(8-12-24)30-28(26-14-13-25(34)19-27(26)36-30)29(35)20-5-9-23(10-6-20)32-17-15-31(16-18-32)22-3-1-2-4-22/h5-14,19,22,33-34H,1-4,15-18H2
n/an/a 1.08n/an/an/an/an/an/a
Chinese Academy of Sciences
Curated by ChEMBL
Assay Description
Inhibition of estrogen receptor alpha
Bioorg Med Chem Lett 15: 1505-7 (2005)
Article DOI: 10.1016/j.bmcl.2004.12.074
BindingDB Entry DOI: 10.7270/Q2D21X4C
Estrogen receptor beta
(Homo sapiens (Human))
BDBM50161710
(CHEMBL366928 | [4-(4-Cyclopentyl-piperazin-1-yl)-p...)
Show SMILES Oc1ccc(cc1)-c1sc2cc(O)ccc2c1C(=O)c1ccc(cc1)N1CCN(CC1)C1CCCC1
Show InChI InChI=1S/C30H30N2O3S/c33-24-11-7-21(8-12-24)30-28(26-14-13-25(34)19-27(26)36-30)29(35)20-5-9-23(10-6-20)32-17-15-31(16-18-32)22-3-1-2-4-22/h5-14,19,22,33-34H,1-4,15-18H2
n/an/a 18.1n/an/an/an/an/an/a
Chinese Academy of Sciences
Curated by ChEMBL
Assay Description
Inhibition of estrogen receptor beta
Bioorg Med Chem Lett 15: 1505-7 (2005)
Article DOI: 10.1016/j.bmcl.2004.12.074
BindingDB Entry DOI: 10.7270/Q2D21X4C