BDBM50161712 (4-Chloro-phenyl)-(4-{4-[6-hydroxy-2-(4-hydroxy-phenyl)-benzo[b]thiophene-3-carbonyl]-phenyl}-piperazin-1-yl)-methanone::CHEMBL180707
SMILES: Oc1ccc(cc1)-c1sc2cc(O)ccc2c1C(=O)c1ccc(cc1)N1CCN(CC1)C(=O)c1ccc(Cl)cc1
InChI Key: InChIKey=QYZVZGPAIPNEDN-UHFFFAOYSA-N
Data: 4 IC50
Activity Spreadsheet -- Enzyme Inhibition Constant Data from BindingDB
Found 4 hits for monomerid = 50161712
Trg + Lig
Ki
nM
ΔG°
kcal/mole
IC50
nM
Kd
nM
EC50/IC50
nM
koff
s-1
kon
M-1s-1
pHTemp
°C
Estrogen receptor
(Homo sapiens (Human))
BDBM50161712
((4-Chloro-phenyl)-(4-{4-[6-hydroxy-2-(4-hydroxy-ph...)
Show SMILES Oc1ccc(cc1)-c1sc2cc(O)ccc2c1C(=O)c1ccc(cc1)N1CCN(CC1)C(=O)c1ccc(Cl)cc1
Show InChI InChI=1S/C32H25ClN2O4S/c33-23-7-1-22(2-8-23)32(39)35-17-15-34(16-18-35)24-9-3-20(4-10-24)30(38)29-27-14-13-26(37)19-28(27)40-31(29)21-5-11-25(36)12-6-21/h1-14,19,36-37H,15-18H2
n/an/a 0.780n/an/an/an/an/an/a
Chinese Academy of Sciences
Curated by ChEMBL
Assay Description
Inhibition of estrogen receptor alpha
Bioorg Med Chem Lett 15: 1505-7 (2005)
Article DOI: 10.1016/j.bmcl.2004.12.074
BindingDB Entry DOI: 10.7270/Q2D21X4C
Estrogen receptor
(Homo sapiens (Human))
BDBM50161712
((4-Chloro-phenyl)-(4-{4-[6-hydroxy-2-(4-hydroxy-ph...)
Show SMILES Oc1ccc(cc1)-c1sc2cc(O)ccc2c1C(=O)c1ccc(cc1)N1CCN(CC1)C(=O)c1ccc(Cl)cc1
Show InChI InChI=1S/C32H25ClN2O4S/c33-23-7-1-22(2-8-23)32(39)35-17-15-34(16-18-35)24-9-3-20(4-10-24)30(38)29-27-14-13-26(37)19-28(27)40-31(29)21-5-11-25(36)12-6-21/h1-14,19,36-37H,15-18H2
n/an/a 0.220n/an/an/an/an/an/a
Torrey Pines Institute for Molecular Studies
Curated by ChEMBL
Assay Description
Displacement of [3H]-17beta-estradiol from ERalpha
Eur J Med Chem 51: 17-34 (2012)
Article DOI: 10.1016/j.ejmech.2012.02.021
BindingDB Entry DOI: 10.7270/Q2ZP474D
Estradiol receptor beta (ERβ)
(Homo sapiens (Human))
BDBM50161712
((4-Chloro-phenyl)-(4-{4-[6-hydroxy-2-(4-hydroxy-ph...)
Show SMILES Oc1ccc(cc1)-c1sc2cc(O)ccc2c1C(=O)c1ccc(cc1)N1CCN(CC1)C(=O)c1ccc(Cl)cc1
Show InChI InChI=1S/C32H25ClN2O4S/c33-23-7-1-22(2-8-23)32(39)35-17-15-34(16-18-35)24-9-3-20(4-10-24)30(38)29-27-14-13-26(37)19-28(27)40-31(29)21-5-11-25(36)12-6-21/h1-14,19,36-37H,15-18H2
n/an/a 9.07n/an/an/an/an/an/a
Torrey Pines Institute for Molecular Studies
Curated by ChEMBL
Assay Description
Displacement of [3H]-17beta-estradiol from ERbeta
Eur J Med Chem 51: 17-34 (2012)
Article DOI: 10.1016/j.ejmech.2012.02.021
BindingDB Entry DOI: 10.7270/Q2ZP474D
Estradiol receptor beta (ERβ)
(Homo sapiens (Human))
BDBM50161712
((4-Chloro-phenyl)-(4-{4-[6-hydroxy-2-(4-hydroxy-ph...)
Show SMILES Oc1ccc(cc1)-c1sc2cc(O)ccc2c1C(=O)c1ccc(cc1)N1CCN(CC1)C(=O)c1ccc(Cl)cc1
Show InChI InChI=1S/C32H25ClN2O4S/c33-23-7-1-22(2-8-23)32(39)35-17-15-34(16-18-35)24-9-3-20(4-10-24)30(38)29-27-14-13-26(37)19-28(27)40-31(29)21-5-11-25(36)12-6-21/h1-14,19,36-37H,15-18H2
n/an/a 4.02n/an/an/an/an/an/a
Chinese Academy of Sciences
Curated by ChEMBL
Assay Description
Inhibition of estrogen receptor beta
Bioorg Med Chem Lett 15: 1505-7 (2005)
Article DOI: 10.1016/j.bmcl.2004.12.074
BindingDB Entry DOI: 10.7270/Q2D21X4C