null
SMILES: CCOc1cc2ncc(C#N)c(Nc3ccc(Sc4nc(cs4)-c4ccccc4)c(Cl)c3)c2cc1NC(=O)\C=C\CN(C)C
InChI Key: InChIKey=YAWRCBHLRDCILP-DHZHZOJOSA-N
Activity Spreadsheet -- Enzyme Inhibition Constant Data from BindingDB
Found 3 hits for monomerid = 50161956
Trg + Lig
Ki
nM
ΔG°
kcal/mole
IC50
nM
Kd
nM
EC50/IC50
nM
koff
s-1
kon
M-1s-1
pHTemp
°C
Receptor tyrosine-protein kinase erbB-2
(Homo sapiens (Human))
BDBM50161956
(4-Dimethylamino-but-2-enoic acid {4-[3-chloro-4-(4...)
Show SMILES CCOc1cc2ncc(C#N)c(Nc3ccc(Sc4nc(cs4)-c4ccccc4)c(Cl)c3)c2cc1NC(=O)\C=C\CN(C)C
Show InChI InChI=1S/C33H29ClN6O2S2/c1-4-42-29-17-26-24(16-27(29)38-31(41)11-8-14-40(2)3)32(22(18-35)19-36-26)37-23-12-13-30(25(34)15-23)44-33-39-28(20-43-33)21-9-6-5-7-10-21/h5-13,15-17,19-20H,4,14H2,1-3H3,(H,36,37)(H,38,41)/b11-8+
n/an/a 13n/an/an/an/an/an/a
University of Southern California
Curated by ChEMBL
Assay Description
Inhibition of HER2 (unknown origin)
J Med Chem 51: 3367-77 (2008)
Article DOI: 10.1021/jm7013875
BindingDB Entry DOI: 10.7270/Q2086532
Receptor tyrosine-protein kinase erbB-2
(Homo sapiens (Human))
BDBM50161956
(4-Dimethylamino-but-2-enoic acid {4-[3-chloro-4-(4...)
Show SMILES CCOc1cc2ncc(C#N)c(Nc3ccc(Sc4nc(cs4)-c4ccccc4)c(Cl)c3)c2cc1NC(=O)\C=C\CN(C)C
Show InChI InChI=1S/C33H29ClN6O2S2/c1-4-42-29-17-26-24(16-27(29)38-31(41)11-8-14-40(2)3)32(22(18-35)19-36-26)37-23-12-13-30(25(34)15-23)44-33-39-28(20-43-33)21-9-6-5-7-10-21/h5-13,15-17,19-20H,4,14H2,1-3H3,(H,36,37)(H,38,41)/b11-8+
n/an/a 13n/an/an/an/an/an/a
Wyeth Research
Curated by ChEMBL
Assay Description
Inhibition of human epidermal growth factor receptor-2 (HER-2) autophosphorylation
J Med Chem 48: 1107-31 (2005)
Article DOI: 10.1021/jm040159c
BindingDB Entry DOI: 10.7270/Q2BP03KG
Epidermal growth factor receptor
(Homo sapiens (Human))
BDBM50161956
(4-Dimethylamino-but-2-enoic acid {4-[3-chloro-4-(4...)
Show SMILES CCOc1cc2ncc(C#N)c(Nc3ccc(Sc4nc(cs4)-c4ccccc4)c(Cl)c3)c2cc1NC(=O)\C=C\CN(C)C
Show InChI InChI=1S/C33H29ClN6O2S2/c1-4-42-29-17-26-24(16-27(29)38-31(41)11-8-14-40(2)3)32(22(18-35)19-36-26)37-23-12-13-30(25(34)15-23)44-33-39-28(20-43-33)21-9-6-5-7-10-21/h5-13,15-17,19-20H,4,14H2,1-3H3,(H,36,37)(H,38,41)/b11-8+
n/an/a 125n/an/an/an/an/an/a
Wyeth Research
Curated by ChEMBL
Assay Description
Inhibition of human epidermal growth factor receptor (EGFR) autophosphorylation
J Med Chem 48: 1107-31 (2005)
Article DOI: 10.1021/jm040159c
BindingDB Entry DOI: 10.7270/Q2BP03KG