BDBM50163159 1-(5-Pyridin-2-yl-oxazol-2-yl)-octadec-9-yn-1-one::CHEMBL174397
SMILES: CCCCCCCCC#CCCCCCCCC(=O)c1ncc(o1)-c1ccccn1
InChI Key: InChIKey=PFSWYEYBMPLGTD-UHFFFAOYSA-N
Data: 1 KI  2 IC50
Activity Spreadsheet -- Enzyme Inhibition Constant Data from BindingDB
Found 3 hits for monomerid = 50163159
Trg + Lig
Ki
nM
ΔG°
kcal/mole
IC50
nM
Kd
nM
EC50/IC50
nM
koff
s-1
kon
M-1s-1
pHTemp
°C
Fatty-acid amide hydrolase 1 (aa 30-579)
(Rattus norvegicus (rat))
BDBM50163159
(1-(5-Pyridin-2-yl-oxazol-2-yl)-octadec-9-yn-1-one ...)
Show SMILES CCCCCCCCC#CCCCCCCCC(=O)c1ncc(o1)-c1ccccn1
Show InChI InChI=1S/C26H36N2O2/c1-2-3-4-5-6-7-8-9-10-11-12-13-14-15-16-20-24(29)26-28-22-25(30-26)23-19-17-18-21-27-23/h17-19,21-22H,2-8,11-16,20H2,1H3
10n/an/an/an/an/an/an/an/a
The Scripps Research Institute
Curated by ChEMBL
Assay Description
Inhibitory constant determined against recombinant Fatty-acid amide hydrolase from rat expressed in Escherichia coli
J Med Chem 48: 1849-56 (2005)
Article DOI: 10.1021/jm049614v
BindingDB Entry DOI: 10.7270/Q2Q52P54
Acyl-CoA: cholesterol acyltransferase (ACAT)
(Homo sapiens (Human))
BDBM50163159
(1-(5-Pyridin-2-yl-oxazol-2-yl)-octadec-9-yn-1-one ...)
Show SMILES CCCCCCCCC#CCCCCCCCC(=O)c1ncc(o1)-c1ccccn1
Show InChI InChI=1S/C26H36N2O2/c1-2-3-4-5-6-7-8-9-10-11-12-13-14-15-16-20-24(29)26-28-22-25(30-26)23-19-17-18-21-27-23/h17-19,21-22H,2-8,11-16,20H2,1H3
n/an/a 3.00E+4n/an/an/an/an/an/a
The Scripps Research Institute
Curated by ChEMBL
Assay Description
Inhibitory concentration against Triacylglycerol hydrolase
J Med Chem 48: 1849-56 (2005)
Article DOI: 10.1021/jm049614v
BindingDB Entry DOI: 10.7270/Q2Q52P54
Fatty-acid amide hydrolase 1
(Homo sapiens (Human))
BDBM50163159
(1-(5-Pyridin-2-yl-oxazol-2-yl)-octadec-9-yn-1-one ...)
Show SMILES CCCCCCCCC#CCCCCCCCC(=O)c1ncc(o1)-c1ccccn1
Show InChI InChI=1S/C26H36N2O2/c1-2-3-4-5-6-7-8-9-10-11-12-13-14-15-16-20-24(29)26-28-22-25(30-26)23-19-17-18-21-27-23/h17-19,21-22H,2-8,11-16,20H2,1H3
n/an/a 20n/an/an/an/an/an/a
The Scripps Research Institute
Curated by ChEMBL
Assay Description
Inhibitory concentration against Fatty-acid amide hydrolase
J Med Chem 48: 1849-56 (2005)
Article DOI: 10.1021/jm049614v
BindingDB Entry DOI: 10.7270/Q2Q52P54