BDBM50163273 2-[4-(4-Chloro-phenylsulfamoyl)-phenyl]-1H-benzoimidazole-5-carboxylic acid amide::CHEMBL195846
SMILES: NC(=O)c1ccc2nc([nH]c2c1)-c1ccc(cc1)S(=O)(=O)Nc1ccc(Cl)cc1
InChI Key: InChIKey=KHJVRUYUSFNQOV-UHFFFAOYSA-N
Data: 1 IC50
Activity Spreadsheet -- Enzyme Inhibition Constant Data from BindingDB
Found 1 hit for monomerid = 50163273
Trg + Lig
Ki
nM
ΔG°
kcal/mole
IC50
nM
Kd
nM
EC50/IC50
nM
koff
s-1
kon
M-1s-1
pHTemp
°C
Serine/threonine-protein kinase CHK2
(Homo sapiens (Human))
BDBM50163273
(2-[4-(4-Chloro-phenylsulfamoyl)-phenyl]-1H-benzoim...)
Show SMILES NC(=O)c1ccc2nc([nH]c2c1)-c1ccc(cc1)S(=O)(=O)Nc1ccc(Cl)cc1
Show InChI InChI=1S/C20H15ClN4O3S/c21-14-4-6-15(7-5-14)25-29(27,28)16-8-1-12(2-9-16)20-23-17-10-3-13(19(22)26)11-18(17)24-20/h1-11,25H,(H2,22,26)(H,23,24)
n/an/a 14n/an/an/an/an/an/a
Johnson & Johnson Pharmaceutical Research and Development
Curated by ChEMBL
Assay Description
Inhibition of recombinant human Chk2 kinase
J Med Chem 48: 1873-85 (2005)
Article DOI: 10.1021/jm0495935
BindingDB Entry DOI: 10.7270/Q2FQ9W4V