BDBM50163282 2-[4-(4-Chloro-3-hydroxy-phenoxy)-phenyl]-1H-benzoimidazole-5-carboxylic acid amide::CHEMBL175472
SMILES: NC(=O)c1ccc2nc([nH]c2c1)-c1ccc(Oc2ccc(Cl)c(O)c2)cc1
InChI Key: InChIKey=RQKQQACLXABERV-UHFFFAOYSA-N
Data: 1 IC50
Activity Spreadsheet -- Enzyme Inhibition Constant Data from BindingDB
Found 1 hit for monomerid = 50163282
Trg + Lig
Ki
nM
ΔG°
kcal/mole
IC50
nM
Kd
nM
EC50/IC50
nM
koff
s-1
kon
M-1s-1
pHTemp
°C
Serine/threonine-protein kinase CHK2
(Homo sapiens (Human))
BDBM50163282
(2-[4-(4-Chloro-3-hydroxy-phenoxy)-phenyl]-1H-benzo...)
Show SMILES NC(=O)c1ccc2nc([nH]c2c1)-c1ccc(Oc2ccc(Cl)c(O)c2)cc1
Show InChI InChI=1S/C20H14ClN3O3/c21-15-7-6-14(10-18(15)25)27-13-4-1-11(2-5-13)20-23-16-8-3-12(19(22)26)9-17(16)24-20/h1-10,25H,(H2,22,26)(H,23,24)
n/an/a 9.80n/an/an/an/an/an/a
Johnson & Johnson Pharmaceutical Research and Development
Curated by ChEMBL
Assay Description
Inhibition of recombinant human Chk2 kinase
J Med Chem 48: 1873-85 (2005)
Article DOI: 10.1021/jm0495935
BindingDB Entry DOI: 10.7270/Q2FQ9W4V