BDBM50163388 CHEMBL3793686
SMILES: CNc1ccccc(C(=O)\C=C\c2cccc(Oc3ccccc3)c2)c1=O
InChI Key: InChIKey=ILGXCSDPVWNLLW-CCEZHUSRSA-N
Data: 1 IC50
Activity Spreadsheet -- Enzyme Inhibition Constant Data from BindingDB
Found 1 hit for monomerid = 50163388
Trg + Lig
Ki
nM
ΔG°
kcal/mole
IC50
nM
Kd
nM
EC50/IC50
nM
koff
s-1
kon
M-1s-1
pHTemp
°C
Lysine-specific demethylase 5A
(Homo sapiens (Human))
BDBM50163388
(CHEMBL3793686)
Show SMILES CNc1ccccc(C(=O)\C=C\c2cccc(Oc3ccccc3)c2)c1=O
Show InChI InChI=1S/C23H19NO3/c1-24-21-13-6-5-12-20(23(21)26)22(25)15-14-17-8-7-11-19(16-17)27-18-9-3-2-4-10-18/h2-16H,1H3,(H,24,26)/b15-14+
Reactome pathway
n/an/a 6.40E+4n/an/an/an/an/an/a
Sichuan University
Curated by ChEMBL
Assay Description
Inhibition of KDM5A (unknown origin) using substrate peptide/ascorbate/2-OG/ Fe(2) as substrate preincubated for 15 mins followed by addition of subs...
Bioorg Med Chem Lett 26: 2284-8 (2016)
BindingDB Entry DOI: 10.7270/Q2XP76TS